{"text_format":"3","workbook":"xlsx","n_sheets":5,"sheets":["S&V Div 1","S&V Div 2","West Oxon","Afternoon Div 1","Afternoon Div 2"],"not_rendered":{"macros":1,"external_links":1,"defined_names":11,"pivot_tables":20},"read":"whole","date_system":"1900"}

{"sheet":"S&V Div 1","index":0,"n_rows":152,"n_cols":26,"rows_kept":152}
[{"$nulls":6},"South & Vale - Division One",{"$nulls":8},{"$f":"SUM(K5:K14)/8","v":{"v":37,"d":"37.0"}},{"$f":"INT(P1)","v":{"v":37,"d":"37.0"}}]
[{"$nulls":6},"Results For Season 2018-19"]
[{"$nulls":3},"Fixtures",{"$nulls":4},"Shots"]
[null," ",null,"Play","W","D","L","For","Aga","Diff","Pts"]
[null,"Wootton 'Chiefs'  ",null,{"$f":"VLOOKUP($B5,$V$34:$Z$48,5,0)+VLOOKUP($B5,$V$19:$Z$31,5,0)","v":8},{"$f":"VLOOKUP($B5,$V$34:$Z$48,4,0)+VLOOKUP($B5,$V$19:$Z$31,4,0)","v":6},{"$f":"VLOOKUP($B5,$V$34:$Z$48,2,0)+VLOOKUP($B5,$V$19:$Z$31,2,0)","v":1},{"$f":"VLOOKUP($B5,$V$34:$Z$48,3,0)+VLOOKUP($B5,$V$19:$Z$31,3,0)","v":1},{"$f":"VLOOKUP($B5,$Q$19:$S$31,3,0)+VLOOKUP($B5,$Q$36:$S$48,3,0)","v":225},{"$f":"H5-J5","v":136},{"$f":"VLOOKUP($B5,$Q$19:$T$31,4,0)+VLOOKUP($B5,$Q$36:$T$48,4,0)","v":89},{"$f":"VLOOKUP($B5,$Q$19:$T$31,2,0)+VLOOKUP($B5,$Q$36:$T$48,2,0)","v":50},{"$nulls":4},{"$f":"(16-D5)*8+K5","v":114}]
[null,"Chieveley   ",null,8,6,0,2,219,165,54,50,{"$nulls":4},{"$f":"(16-D6)*8+K6","v":114}]
[null,"Warborough 'Wanderers'  ",null,8,6,0,2,199,144,55,46,{"$nulls":4},110]
[null,"Didcot Bowls Club 'Rams'",null,9,5,0,4,211,198,13,36,{"$nulls":4},92]
[null,"Wallingford 'Royals'  ",null,9,4,0,5,208,198,10,36,{"$nulls":4},92]
[null,"Grove 'Grovelands'  ",null,8,3,0,5,148,196,-48,26,{"$nulls":4},90]
[null,"Cholsey 'Canaries'",null,8,2,1,5,166,214,-48,20,{"$nulls":4},84]
[null,"Stanford 'Village'",null,8,2,0,6,163,200,-37,16,{"$nulls":4},80]
[null,"Stanford 'Vale'",null,8,2,0,6,145,233,-88,16,{"$nulls":4},80]
[]
[null,"DATE","Home",".","Pts","Sht","v","Away",".","Pts","Sht","Result","Diff","Result","Diff",{"$nulls":6},"Sht","(All)"]
["Wk 1","2018-09-24","Stanford 'Village'",null,0,19,"v","Wallingford 'Royals'  ",null,8,30,{"$f":"IF(E16=\" \",\" \",IF(E16<4,\"L\",IF(E16=4,\"D\",\"W\")))","v":"L"},{"$f":"F16-K16","v":-11},{"$f":"IF(J16=\" \",\" \",IF(J16<4,\"L\",IF(J16=4,\"D\",\"W\")))","v":"W"},{"$f":"K16-F16","v":11},null,"Home"]
["x",{"$nulls":10},"D",0,"D",0,null,null,"Values",{"$nulls":3},"Count of Pts","Column Labels"]
["Wk 2","2018-10-01","Stanford 'Village'",null,0,17,"v","Warborough 'Wanderers'  ",null,8,22,"L",-5,"W",5,null,"Row Labels","Sum of Pts","Sum of Sht","Sum of Diff",null,"Row Labels","D","L","W","Grand Total"]
["Wk 2","2018-10-02","Cholsey 'Canaries'",null,4,20,"v","Wootton 'Chiefs'  ",null,4,20,"D",0,"D",0,null,"Chieveley   ",34,149,53,null,"Chieveley   ",null,1,4,5]
["Wk 2","2018-10-04","Chieveley   ",null,8,36,"v","Grove 'Grovelands'  ",null,0,17,"W",19,"L",-19,null,"Cholsey 'Canaries'",18,95,11,null,"Cholsey 'Canaries'",1,1,2,4]
["Wk 2","2018-10-04","Didcot Bowls Club 'Rams'",null,8,33,"v","Wallingford 'Royals'  ",null,0,13,"W",20,"L",-20,null,"Didcot Bowls Club 'Rams'",22,106,31,null,"Didcot Bowls Club 'Rams'",null,1,3,4]
["x",{"$nulls":10},"W",0,"W",0,null,"Grove 'Grovelands'  ",18,74,22,null,"Grove 'Grovelands'  ",null,1,2,3]
["Wk 3","2018-10-08","Stanford 'Vale'",null,2,23,"v","Chieveley   ",null,6,24,"L",-1,{"$f":"IF(J23=\" \",\" \",IF(J23<4,\"L\",IF(J23=4,\"D\",\"W\")))","v":"W"},1,null,"Stanford 'Vale'",16,98,4,null,"Stanford 'Vale'",null,2,2,4]
["Wk 3","2018-10-10","Grove 'Grovelands'  ",null,2,21,"v","Didcot Bowls Club 'Rams'",null,6,22,"L",-1,"W",1,null,"Stanford 'Village'",16,101,24,null,"Stanford 'Village'",null,2,2,4]
["Wk 3","2018-10-11","Wallingford 'Royals'  ",null,8,25,"v","Warborough 'Wanderers'  ",null,0,17,"W",8,"L",-8,null,"Wallingford 'Royals'  ",26,132,35,null,"Wallingford 'Royals'  ",null,2,3,5]
["x",{"$nulls":10},"L",0,"L",0,null,"Warborough 'Wanderers'  ",24,98,29,null,"Warborough 'Wanderers'  ",null,1,3,4]
["Wk 4","2018-10-18","Chieveley   ",null,8,40,"v","Cholsey 'Canaries'",null,0,17,"W",23,"L",-23,null,"Wootton 'Chiefs'  ",32,134,81,null,"Wootton 'Chiefs'  ",null,null,4,4]
["Wk 4","2018-10-18","Didcot Bowls Club 'Rams'",null,8,35,"v","Stanford 'Vale'",null,0,16,"W",19,"L",-19,null,"(blank)",null,null,0,null,"(blank)"]
["Wk 4","2018-10-18","Warborough 'Wanderers'  ",null,8,20,"v","Grove 'Grovelands'  ",null,0,7,"W",13,"L",-13,null,"Grand Total",206,987,290,null,"Grand Total",1,11,25,37]
["x",{"$nulls":10},"L",0,"L",0]
["Wk 6","2018-10-29","Stanford 'Vale'",null,2,20,"v","Warborough 'Wanderers'  ",null,6,30,"L",-10,"W",10]
["Wk 6","2018-10-30","Cholsey 'Canaries'",null,6,25,"v","Didcot Bowls Club 'Rams'",null,2,24,"W",1,"L",-1]
["Wk 6","2018-10-31","Grove 'Grovelands'  ",null,8,22,"v","Stanford 'Village'",null,0,19,"W",3,"L",-3]
["Wk 6","2018-10-31","Wootton 'Chiefs'  ",null,8,29,"v","Wallingford 'Royals'  ",null,0,14,"W",15,"L",-15,null,null,"Values",{"$nulls":3},"Count of Pts","Column Labels"]
["Wk 6","2018-11-01","Wallingford 'Royals'  ",null,8,26,"v","Cholsey 'Canaries'",null,0,19,"W",7,"L",-7,null,"Row Labels","Sum of Pts","Sum of Sht","Sum of Diff2",null,"Row Labels","D","L","W","Grand Total"]
["x",{"$nulls":10},"L",0,"L",0,null,"Chieveley   ",16,70,1,null,"Chieveley   ",null,1,2,3]
["Wk 7","2018-11-05","Stanford 'Village'",null,8,40,"v","Stanford 'Vale'",null,0,8,"W",32,"L",-32,null,"Cholsey 'Canaries'",2,71,-59,null,"Cholsey 'Canaries'",null,4,null,4]
["Wk 7","2018-11-08","Chieveley   ",null,2,14,"v","Wootton 'Chiefs'  ",null,6,30,"L",-16,"W",16,null,"Didcot Bowls Club 'Rams'",14,105,-18,null,"Didcot Bowls Club 'Rams'",null,3,2,5]
["Wk 7","2018-11-08","Wallingford 'Royals'  ",null,8,40,"v","Grove 'Grovelands'  ",null,0,14,"W",26,"L",-26,null,"Grove 'Grovelands'  ",8,74,-70,null,"Grove 'Grovelands'  ",null,4,1,5]
["Wk 7","2018-11-08","Warborough 'Wanderers'  ",null,8,29,"v","Cholsey 'Canaries'",null,0,14,{"$f":"IF(E40=\" \",\" \",IF(E40<4,\"L\",IF(E40=4,\"D\",\"W\")))","v":"W"},{"$f":"F40-K40","v":15},"L",{"$f":"K40-F40","v":-15},null,"Stanford 'Vale'",0,47,-92,null,"Stanford 'Vale'",null,4,null,4]
["x",{"$nulls":10},"L",0,"L",0,null,"Stanford 'Village'",0,62,-61,null,"Stanford 'Village'",null,4,null,4]
["Wk 8","2018-11-12","Stanford 'Vale'",null,6,20,"v","Wallingford 'Royals'  ",null,2,19,"W",1,"L",-1,null,"Wallingford 'Royals'  ",10,76,-25,null,"Wallingford 'Royals'  ",null,3,1,4]
["Wk 8","2018-11-13","Cholsey 'Canaries'",null,8,33,"v","Stanford 'Village'",null,0,14,"W",19,"L",-19,null,"Warborough 'Wanderers'  ",22,101,26,null,"Warborough 'Wanderers'  ",null,1,3,4]
["Wk 8","2018-11-14","Wootton 'Chiefs'  ",null,8,31,"v","Grove 'Grovelands'  ",null,0,10,"W",21,"L",-21,null,"Wootton 'Chiefs'  ",18,91,8,null,"Wootton 'Chiefs'  ",1,1,2,4]
["Wk 8","2018-11-15","Chieveley   ",null,8,32,"v","Didcot Bowls Club 'Rams'",null,0,20,"W",12,{"$f":"IF(J45=\" \",\" \",IF(J45<4,\"L\",IF(J45=4,\"D\",\"W\")))","v":"L"},-12,null,"(blank)",null,null,0,null,"(blank)"]
["x",{"$nulls":10},{"$f":"IF(E46=\" \",\" \",IF(E46<4,\"L\",IF(E46=4,\"D\",\"W\")))","v":"L"},{"$f":"F46-K46","v":0},{"$f":"IF(J46=\" \",\" \",IF(J46<4,\"L\",IF(J46=4,\"D\",\"W\")))","v":"L"},{"$f":"K46-F46","v":0},null,"Grand Total",90,697,-290,null,"Grand Total",1,25,11,37]
["Wk10","2018-11-28","Grove 'Grovelands'  ",null,8,31,"v","Stanford 'Vale'",null,0,11,"W",20,"L",-20]
["Wk10","2018-11-29","Didcot Bowls Club 'Rams'",null,6,25,"v","Wootton 'Chiefs'  ",null,2,14,"W",11,{"$f":"IF(J48=\" \",\" \",IF(J48<4,\"L\",IF(J48=4,\"D\",\"W\")))","v":"L"},-11]
["Wk10","2018-11-29","Warborough 'Wanderers'  ",null,6,25,"v","Chieveley   ",null,2,21,"W",4,{"$f":"IF(J49=\" \",\" \",IF(J49<4,\"L\",IF(J49=4,\"D\",\"W\")))","v":"L"},-4]
["x",{"$nulls":10},"L",0,{"$f":"IF(J50=\" \",\" \",IF(J50<4,\"L\",IF(J50=4,\"D\",\"W\")))","v":"L"},0]
["Wk11","2018-12-04","Cholsey 'Canaries'",null,0,17,"v","Grove 'Grovelands'  ",null,8,26,"L",-9,"W",9]
["Wk11","2018-12-05","Wootton 'Chiefs'  ",null,8,33,"v","Stanford 'Vale'",null,0,12,"W",21,{"$f":"IF(J52=\" \",\" \",IF(J52<4,\"L\",IF(J52=4,\"D\",\"W\")))","v":"L"},-21]
["Wk11","2018-12-06","Chieveley   ",null,8,27,"v","Stanford 'Village'",null,0,12,"W",15,{"$f":"IF(J53=\" \",\" \",IF(J53<4,\"L\",IF(J53=4,\"D\",\"W\")))","v":"L"},-15]
["Wk11","2018-12-06","Didcot Bowls Club 'Rams'",null,0,13,"v","Warborough 'Wanderers'  ",null,8,32,"L",-19,"W",19]
["x",{"$nulls":10},"L",0,{"$f":"IF(J55=\" \",\" \",IF(J55<4,\"L\",IF(J55=4,\"D\",\"W\")))","v":"L"},0]
["Wk12","2018-12-10","Stanford 'Vale'",null,6,35,"v","Cholsey 'Canaries'",null,2,21,"W",14,{"$f":"IF(J56=\" \",\" \",IF(J56<4,\"L\",IF(J56=4,\"D\",\"W\")))","v":"L"},-14]
["Wk12","2018-12-10","Stanford 'Village'",null,8,25,"v","Didcot Bowls Club 'Rams'",null,0,17,"W",8,"L",-8]
["Wk12","2018-12-13","Wallingford 'Royals'  ",null,0,21,"v","Chieveley   ",null,8,25,"L",-4,"W",4]
["Wk12","2018-12-13","Warborough 'Wanderers'  ",null,2,24,"v","Wootton 'Chiefs'  ",null,6,27,"L",-3,"W",3]
["x",{"$nulls":10},"L",0,"L",0]
["Wk13","2018-12-19","Wootton 'Chiefs'  ",null,8,41,"v","Stanford 'Village'",null,0,17,"W",24,"L",-24]
["x",{"$nulls":10},{"$f":"IF(E62=\" \",\" \",IF(E62<4,\"L\",IF(E62=4,\"D\",\"W\")))","v":"L"},{"$f":"F62-K62","v":0},{"$f":"IF(J62=\" \",\" \",IF(J62<4,\"L\",IF(J62=4,\"D\",\"W\")))","v":"L"},{"$f":"K62-F62","v":0}]
["Wk14","2019-01-03","Wallingford 'Royals'  ",null,2,20,"v","Didcot Bowls Club 'Rams'",null,6,22,{"$f":"IF(E63=\" \",\" \",IF(E63<4,\"L\",IF(E63=4,\"D\",\"W\")))","v":"L"},{"$f":"F63-K63","v":-2},{"$f":"IF(J63=\" \",\" \",IF(J63<4,\"L\",IF(J63=4,\"D\",\"W\")))","v":"W"},{"$f":"K63-F63","v":2}]
["x",{"$nulls":10},"L",0,{"$f":"IF(J64=\" \",\" \",IF(J64<4,\"L\",IF(J64=4,\"D\",\"W\")))","v":"L"},0]
["Wk16","2019-01-14","Stanford 'Village'",{"$nulls":3},"v","Wootton 'Chiefs'  ",{"$nulls":3},"L",0,{"$f":"IF(J65=\" \",\" \",IF(J65<4,\"L\",IF(J65=4,\"D\",\"W\")))","v":"L"},0]
["Wk16","2019-01-17","Chieveley   ",{"$nulls":3},"v","Stanford 'Vale'",{"$nulls":3},"L",0,"L",0]
["Wk16","2019-01-17","Didcot Bowls Club 'Rams'",{"$nulls":3},"v","Grove 'Grovelands'  ",{"$nulls":3},"L",0,"L",0]
["Wk16","2019-01-17","Warborough 'Wanderers'  ",{"$nulls":3},"v","Wallingford 'Royals'  ",{"$nulls":3},"L",0,"L",0]
["x",{"$nulls":10},{"$f":"IF(E69=\" \",\" \",IF(E69<4,\"L\",IF(E69=4,\"D\",\"W\")))","v":"L"},{"$f":"F69-K69","v":0},"L",{"$f":"K69-F69","v":0}]
["Wk17","2019-01-21","Stanford 'Vale'",{"$nulls":3},"v","Didcot Bowls Club 'Rams'",{"$nulls":3},"L",0,"L",0]
["Wk17","2019-01-22","Cholsey 'Canaries'",{"$nulls":3},"v","Chieveley   ",{"$nulls":3},"L",0,"L",0]
["Wk17","2019-01-23","Grove 'Grovelands'  ",{"$nulls":3},"v","Warborough 'Wanderers'  ",{"$nulls":3},"L",0,{"$f":"IF(J72=\" \",\" \",IF(J72<4,\"L\",IF(J72=4,\"D\",\"W\")))","v":"L"},0]
["Wk17","2019-01-24","Wallingford 'Royals'  ",{"$nulls":3},"v","Stanford 'Village'",{"$nulls":3},"L",0,"L",0]
["x",{"$nulls":10},{"$f":"IF(E74=\" \",\" \",IF(E74<4,\"L\",IF(E74=4,\"D\",\"W\")))","v":"L"},{"$f":"F74-K74","v":0},{"$f":"IF(J74=\" \",\" \",IF(J74<4,\"L\",IF(J74=4,\"D\",\"W\")))","v":"L"},{"$f":"K74-F74","v":0}]
["Wk18","2019-01-28","Stanford 'Village'",{"$nulls":3},"v","Grove 'Grovelands'  ",{"$nulls":3},"L",0,"L",0]
["Wk18","2019-01-31","Didcot Bowls Club 'Rams'",{"$nulls":3},"v","Cholsey 'Canaries'",{"$nulls":3},"L",0,"L",0]
["Wk18","2019-01-31","Wallingford 'Royals'  ",{"$nulls":3},"v","Wootton 'Chiefs'  ",{"$nulls":3},"L",0,{"$f":"IF(J77=\" \",\" \",IF(J77<4,\"L\",IF(J77=4,\"D\",\"W\")))","v":"L"},0]
["Wk18","2019-01-31","Warborough 'Wanderers'  ",{"$nulls":3},"v","Stanford 'Vale'",{"$nulls":3},"L",0,"L",0]
["x",{"$nulls":10},{"$f":"IF(E79=\" \",\" \",IF(E79<4,\"L\",IF(E79=4,\"D\",\"W\")))","v":"L"},{"$f":"F79-K79","v":0},"L",{"$f":"K79-F79","v":0}]
["Wk20","2019-02-11","Stanford 'Vale'",{"$nulls":3},"v","Stanford 'Village'",{"$nulls":3},"L",0,"L",0]
["Wk20","2019-02-12","Cholsey 'Canaries'",{"$nulls":3},"v","Warborough 'Wanderers'  ",{"$nulls":3},{"$f":"IF(E81=\" \",\" \",IF(E81<4,\"L\",IF(E81=4,\"D\",\"W\")))","v":"L"},{"$f":"F81-K81","v":0},"L",{"$f":"K81-F81","v":0}]
["Wk20","2019-02-13","Grove 'Grovelands'  ",{"$nulls":3},"v","Wallingford 'Royals'  ",{"$nulls":3},"L",0,"L",0]
["Wk20","2019-02-13","Wootton 'Chiefs'  ",{"$nulls":3},"v","Chieveley   ",{"$nulls":3},"L",0,"L",0]
["x",{"$nulls":10},"L",0,"L",0]
["Wk21","2019-02-18","Stanford 'Village'",{"$nulls":3},"v","Cholsey 'Canaries'",{"$nulls":3},{"$f":"IF(E85=\" \",\" \",IF(E85<4,\"L\",IF(E85=4,\"D\",\"W\")))","v":"L"},{"$f":"F85-K85","v":0},{"$f":"IF(J85=\" \",\" \",IF(J85<4,\"L\",IF(J85=4,\"D\",\"W\")))","v":"L"},{"$f":"K85-F85","v":0}]
["Wk21","2019-02-20","Grove 'Grovelands'  ",{"$nulls":3},"v","Wootton 'Chiefs'  ",{"$nulls":3},"L",0,"L",0]
["Wk21","2019-02-21","Didcot Bowls Club 'Rams'",{"$nulls":3},"v","Chieveley   ",{"$nulls":3},"L",0,"L",0]
["Wk21","2019-02-21","Wallingford 'Royals'  ",{"$nulls":3},"v","Stanford 'Vale'",{"$nulls":3},"L",0,"L",0]
["x",{"$nulls":10},"L",0,"L",0]
["Wk22","2019-02-25","Stanford 'Vale'",{"$nulls":3},"v","Grove 'Grovelands'  ",{"$nulls":3},"L",0,"L",0]
["Wk22","2019-02-26","Cholsey 'Canaries'",{"$nulls":3},"v","Wallingford 'Royals'  ",{"$nulls":3},"L",0,"L",0]
["Wk22","2019-02-27","Wootton 'Chiefs'  ",{"$nulls":3},"v","Didcot Bowls Club 'Rams'",{"$nulls":3},"L",0,"L",0]
["Wk22","2019-02-28","Chieveley   ",{"$nulls":3},"v","Warborough 'Wanderers'  ",{"$nulls":3},"L",0,"L",0]
["x",{"$nulls":10},{"$f":"IF(E94=\" \",\" \",IF(E94<4,\"L\",IF(E94=4,\"D\",\"W\")))","v":"L"},{"$f":"F94-K94","v":0},{"$f":"IF(J94=\" \",\" \",IF(J94<4,\"L\",IF(J94=4,\"D\",\"W\")))","v":"L"},{"$f":"K94-F94","v":0}]
["Wk23","2019-03-04","Stanford 'Village'",{"$nulls":3},"v","Chieveley   ",{"$nulls":3},"W",{"$f":"F95-K95","v":0},"W",{"$f":"K95-F95","v":0}]
["x",{"$nulls":10},{"$f":"IF(E96=\" \",\" \",IF(E96<4,\"L\",IF(E96=4,\"D\",\"W\")))","v":"L"},{"$f":"F96-K96","v":0},{"$f":"IF(J96=\" \",\" \",IF(J96<4,\"L\",IF(J96=4,\"D\",\"W\")))","v":"L"},{"$f":"K96-F96","v":0}]
["Wk24","2019-03-11","Stanford 'Vale'",{"$nulls":3},"v","Wootton 'Chiefs'  ",{"$nulls":3},"D",0,"D",0]
["Wk24","2019-03-13","Grove 'Grovelands'  ",{"$nulls":3},"v","Cholsey 'Canaries'",{"$nulls":3},"W",{"$f":"F98-K98","v":0},"W",{"$f":"K98-F98","v":0}]
["Wk24","2019-03-14","Warborough 'Wanderers'  ",{"$nulls":3},"v","Didcot Bowls Club 'Rams'",{"$nulls":3},"W",0,"W",0]
["x",{"$nulls":10},"W",0,"W",0]
["Wk25","2019-03-19","Cholsey 'Canaries'",{"$nulls":3},"v","Stanford 'Vale'",{"$nulls":3},"W",0,"W",0]
["Wk25","2019-03-20","Wootton 'Chiefs'  ",{"$nulls":3},"v","Warborough 'Wanderers'  ",{"$nulls":3},"W",0,"W",0]
["Wk25","2019-03-21","Chieveley   ",{"$nulls":3},"v","Wallingford 'Royals'  ",{"$nulls":3},"W",0,"W",0]
["Wk25","2019-03-21","Didcot Bowls Club 'Rams'",{"$nulls":3},"v","Stanford 'Village'",{"$nulls":3},"W",0,"W",0]
["x",{"$nulls":10},"W",0,"W",0]
["Wk26","2019-03-27","Grove 'Grovelands'  ",{"$nulls":3},"v","Chieveley   ",{"$nulls":3},"W",0,"W",0]
["Wk26","2019-03-27","Wootton 'Chiefs'  ",{"$nulls":3},"v","Cholsey 'Canaries'",{"$nulls":3},"W",0,"W",0]
["Wk26","2019-03-28","Warborough 'Wanderers'  ",{"$nulls":3},"v","Stanford 'Village'",{"$nulls":3},"W",0,"W",0]
["x"]
["x"]
["x"]
["x"]
["x"]
["x"]
["x"]
["x"]
["x"]
["x"]
["x"]
["x"]
["x"]
["x"]
["x"]
["x"]
["x"]
["x"]
["x"]
["x"]
["x"]
["x"]
["x"]
["x"]
["x"]
["x"]
["x"]
["x"]
["x"]
["x"]
["x"]
["x"]
["x"]
["x"]
["x"]
["x"]
["x"]
["x"]
["x"]
["x"]
["x"]
["x"]
["x"]
["x"]

{"sheet":"S&V Div 2","index":1,"n_rows":151,"n_cols":26,"rows_kept":151}
[{"$nulls":6},"South & Vale - Division Two",{"$nulls":8},{"$f":"SUM(K5:K14)/8","v":{"v":35,"d":"35.0"}},{"$f":"INT(P1)","v":{"v":35,"d":"35.0"}}]
[{"$nulls":6},"Results For Season 2018-19"]
[{"$nulls":3},"Fixtures",{"$nulls":4},"Shots"]
[null," ",null,"Play","W","D","L","For","Aga","Diff","Pts"]
[null,"Abingdon 'Knights'  ",null,{"$f":"VLOOKUP($B5,$V$34:$Z$48,5,0)+VLOOKUP($B5,$V$19:$Z$31,5,0)","v":8},{"$f":"VLOOKUP($B5,$V$34:$Z$48,4,0)+VLOOKUP($B5,$V$19:$Z$31,4,0)","v":6},{"$f":"VLOOKUP($B5,$V$34:$Z$48,2,0)+VLOOKUP($B5,$V$19:$Z$31,2,0)","v":1},{"$f":"VLOOKUP($B5,$V$34:$Z$48,3,0)+VLOOKUP($B5,$V$19:$Z$31,3,0)","v":1},{"$f":"VLOOKUP($B5,$Q$19:$S$31,3,0)+VLOOKUP($B5,$Q$36:$S$48,3,0)","v":193},{"$f":"H5-J5","v":153},{"$f":"VLOOKUP($B5,$Q$19:$T$31,4,0)+VLOOKUP($B5,$Q$36:$T$48,4,0)","v":40},{"$f":"VLOOKUP($B5,$Q$19:$T$31,2,0)+VLOOKUP($B5,$Q$36:$T$48,2,0)","v":50},{"$nulls":4},{"$f":"(16-D5)*8+K5","v":114}]
[null,"Benson",null,8,6,0,2,207,167,40,43,{"$nulls":4},{"$f":"(16-D6)*8+K6","v":107}]
[null,"Harwell 'Hares'  ",null,8,5,0,3,197,177,20,40,{"$nulls":4},104]
[null,"Challow 'Windymillers'  ",null,7,4,1,2,170,145,25,38,{"$nulls":4},110]
[null,"Hanney",null,8,3,0,5,183,196,-13,23,{"$nulls":4},87]
[null,"Harwell 'Harlequins'",null,8,2,1,5,171,195,-24,23,{"$nulls":4},87]
[null,"Wootton 'Warriors'  ",null,8,3,0,5,155,192,-37,23,{"$nulls":4},87]
[null,"S.O. 'Three Swans' ",null,7,2,1,4,152,153,-1,22,{"$nulls":4},94]
[null,"Didcot Bowls Club 'Hounds'",null,8,2,0,6,141,191,-50,18,{"$nulls":4},82]
[]
[null,"DATE","Home",".","Pts","Sht","v","Away",".","Pts","Sht","Result","Diff","Result","Diff",{"$nulls":6},"Sht","(All)"]
["Wk 1","2018-09-27","Benson",null,8,30,"v","Hanney",null,0,19,{"$f":"IF(E16=\" \",\" \",IF(E16<4,\"L\",IF(E16=4,\"D\",\"W\")))","v":"W"},{"$f":"F16-K16","v":11},{"$f":"IF(J16=\" \",\" \",IF(J16<4,\"L\",IF(J16=4,\"D\",\"W\")))","v":"L"},{"$f":"K16-F16","v":-11},null,"Home"]
["x",{"$nulls":10},"L",0,{"$f":"IF(J17=\" \",\" \",IF(J17<4,\"L\",IF(J17=4,\"D\",\"W\")))","v":"L"},0,null,null,"Values",{"$nulls":3},"Count of Pts","Column Labels"]
["Wk 2","2018-10-01","Harwell 'Harlequins'",null,1,18,"v","Benson",null,7,36,"L",-18,{"$f":"IF(J18=\" \",\" \",IF(J18<4,\"L\",IF(J18=4,\"D\",\"W\")))","v":"W"},18,null,"Row Labels","Sum of Pts","Sum of Sht","Sum of Diff",null,"Row Labels","D","L","W","Grand Total"]
["Wk 2","2018-10-03","Wootton 'Warriors'  ",null,0,15,"v","Harwell 'Hares'  ",null,8,31,"L",-16,{"$f":"IF(J19=\" \",\" \",IF(J19<4,\"L\",IF(J19=4,\"D\",\"W\")))","v":"W"},16,null,"Abingdon 'Knights'  ",22,83,15,null,"Abingdon 'Knights'  ",null,1,3,4]
["Wk 2","2018-10-04","Abingdon 'Knights'  ",null,8,27,"v","Didcot Bowls Club 'Hounds'",null,0,12,"W",15,"L",-15,null,"Benson",14,76,7,null,"Benson",null,1,2,3]
["x",{"$nulls":10},"L",0,"L",0,null,"Challow 'Windymillers'  ",34,131,35,null,"Challow 'Windymillers'  ",1,null,4,5]
["Wk 3","2018-10-08","Harwell 'Harlequins'",null,0,16,"v","Harwell 'Hares'  ",null,8,30,"L",-14,"W",14,null,"Didcot Bowls Club 'Hounds'",14,58,5,null,"Didcot Bowls Club 'Hounds'",null,1,2,3]
["Wk 3","2018-10-10","Hanney",null,6,26,"v","Challow 'Windymillers'  ",null,2,18,"W",8,"L",-8,null,"Hanney",20,116,34,null,"Hanney",null,1,3,4]
["Wk 3","2018-10-11","Benson",null,0,21,"v","Abingdon 'Knights'  ",null,8,27,"L",-6,"W",6,null,"Harwell 'Hares'  ",20,97,11,null,"Harwell 'Hares'  ",null,1,3,4]
["x",{"$nulls":10},"L",0,{"$f":"IF(J25=\" \",\" \",IF(J25<4,\"L\",IF(J25=4,\"D\",\"W\")))","v":"L"},0,null,"Harwell 'Harlequins'",21,128,-1,null,"Harwell 'Harlequins'",1,2,2,5]
["Wk 4","2018-10-15","Harwell 'Hares'  ",null,8,34,"v","S.O. 'Three Swans' ",null,0,20,"W",14,"L",-14,null,"S.O. 'Three Swans' ",14,77,25,null,"S.O. 'Three Swans' ",null,1,2,3]
["Wk 4","2018-10-17","Challow 'Windymillers'  ",null,6,23,"v","Didcot Bowls Club 'Hounds'",null,2,19,"W",4,"L",-4,null,"Wootton 'Warriors'  ",15,83,-2,null,"Wootton 'Warriors'  ",null,2,2,4]
["Wk 4","2018-10-17","Wootton 'Warriors'  ",null,7,26,"v","Hanney",null,1,17,"W",9,"L",-9,null,"(blank)",null,null,0,null,"(blank)"]
["Wk 4","2018-10-18","Abingdon 'Knights'  ",null,6,18,"v","Harwell 'Harlequins'",null,2,17,"W",1,"L",-1,null,"Grand Total",174,849,129,null,"Grand Total",2,10,23,35]
["x",{"$nulls":10},"L",0,"L",0]
["Wk 6","2018-10-29","Harwell 'Harlequins'",null,4,26,"v","S.O. 'Three Swans' ",null,4,26,"D",0,"D",0]
["Wk 6","2018-10-30","Challow 'Windymillers'  ",null,8,28,"v","Benson",null,0,19,"W",9,"L",-9]
["Wk 6","2018-10-31","Hanney",null,6,35,"v","Harwell 'Hares'  ",null,2,16,"W",19,"L",-19]
["Wk 6","2018-11-01","Didcot Bowls Club 'Hounds'",null,8,23,"v","Wootton 'Warriors'  ",null,0,15,"W",8,"L",-8,null,null,"Values",{"$nulls":3},"Count of Pts","Column Labels"]
["x",{"$nulls":10},"L",0,"L",0,null,"Row Labels","Sum of Pts","Sum of Sht","Sum of Diff2",null,"Row Labels","D","L","W","Grand Total"]
["Wk 7","2018-11-05","Harwell 'Hares'  ",null,6,25,"v","Didcot Bowls Club 'Hounds'",null,2,18,"W",7,"L",-7,null,"Abingdon 'Knights'  ",28,110,25,null,"Abingdon 'Knights'  ",1,null,3,4]
["Wk 7","2018-11-05","S.O. 'Three Swans' ",null,6,26,"v","Hanney",null,2,15,"W",11,"L",-11,null,"Benson",29,131,33,null,"Benson",null,1,4,5]
["Wk 7","2018-11-06","Challow 'Windymillers'  ",null,4,21,"v","Abingdon 'Knights'  ",null,4,21,"D",0,"D",0,null,"Challow 'Windymillers'  ",4,39,-10,null,"Challow 'Windymillers'  ",null,2,null,2]
["Wk 7","2018-11-07","Wootton 'Warriors'  ",null,0,19,"v","Benson",null,8,29,"L",-10,"W",10,null,"Didcot Bowls Club 'Hounds'",4,83,-55,null,"Didcot Bowls Club 'Hounds'",null,5,null,5]
["x",{"$nulls":10},"L",0,"L",0,null,"Hanney",3,67,-47,null,"Hanney",null,4,null,4]
["Wk 8","2018-11-12","Harwell 'Harlequins'",null,8,32,"v","Hanney",null,0,16,"W",16,"L",-16,null,"Harwell 'Hares'  ",20,100,9,null,"Harwell 'Hares'  ",null,2,2,4]
["Wk 8","2018-11-15","Abingdon 'Knights'  ",null,2,17,"v","Wootton 'Warriors'  ",null,6,24,"L",-7,"W",7,null,"Harwell 'Harlequins'",2,43,-23,null,"Harwell 'Harlequins'",null,3,null,3]
["Wk 8","2018-11-15","Benson",null,6,25,"v","Harwell 'Hares'  ",null,2,23,"W",2,"L",-2,null,"S.O. 'Three Swans' ",8,75,-26,null,"S.O. 'Three Swans' ",1,3,null,4]
["Wk 8","2018-11-15","Didcot Bowls Club 'Hounds'",null,6,20,"v","S.O. 'Three Swans' ",null,2,14,"W",6,"L",-6,null,"Wootton 'Warriors'  ",8,72,-35,null,"Wootton 'Warriors'  ",null,3,1,4]
["x",{"$nulls":10},"L",0,"L",0,null,"(blank)",null,null,0,null,"(blank)"]
["Wk10","2018-11-26","Harwell 'Hares'  ",null,0,15,"v","Abingdon 'Knights'  ",null,8,27,"L",-12,"W",12,null,"Grand Total",106,720,-129,null,"Grand Total",2,23,10,35]
["Wk10","2018-11-26","S.O. 'Three Swans' ",null,2,18,"v","Benson",null,6,23,"L",-5,"W",5]
["Wk10","2018-11-27","Challow 'Windymillers'  ",null,8,25,"v","Harwell 'Harlequins'",null,0,18,{"$f":"IF(E48=\" \",\" \",IF(E48<4,\"L\",IF(E48=4,\"D\",\"W\")))","v":"W"},{"$f":"F48-K48","v":7},"L",{"$f":"K48-F48","v":-7}]
["Wk10","2018-11-28","Hanney",null,8,27,"v","Didcot Bowls Club 'Hounds'",null,0,13,"W",14,"L",-14]
["x",{"$nulls":10},"L",0,"L",0]
["Wk11","2018-12-03","Harwell 'Harlequins'",null,8,36,"v","Didcot Bowls Club 'Hounds'",null,0,21,"W",15,"L",-15]
["Wk11","2018-12-04","Challow 'Windymillers'  ",null,8,34,"v","Wootton 'Warriors'  ",null,0,19,"W",15,"L",-15]
["Wk11","2018-12-06","Abingdon 'Knights'  ",null,6,21,"v","S.O. 'Three Swans' ",null,2,15,"W",6,"L",-6]
["x",{"$nulls":10},"L",0,"L",0]
["Wk12","2018-12-10","Harwell 'Hares'  ",null,6,23,"v","Challow 'Windymillers'  ",null,2,21,"W",2,"L",-2]
["Wk12","2018-12-12","Hanney",null,0,28,"v","Abingdon 'Knights'  ",null,8,35,"L",-7,"W",7]
["Wk12","2018-12-12","Wootton 'Warriors'  ",null,8,23,"v","Harwell 'Harlequins'",null,0,8,"W",15,"L",-15]
["Wk12","2018-12-13","Didcot Bowls Club 'Hounds'",null,0,15,"v","Benson",null,8,24,"L",-9,"W",9]
["x",{"$nulls":10},"L",0,"L",0]
["Wk13","2018-12-17","S.O. 'Three Swans' ",null,6,33,"v","Wootton 'Warriors'  ",null,2,14,"W",19,"L",-19]
["x",{"$nulls":10},"L",0,"L",0]
["Wk16","2019-01-14","Harwell 'Hares'  ",{"$nulls":3},"v","Harwell 'Harlequins'",{"$nulls":3},"L",0,"L",0]
["Wk16","2019-01-15","Challow 'Windymillers'  ",{"$nulls":3},"v","Hanney",{"$nulls":3},"L",0,"L",0]
["Wk16","2019-01-16","Wootton 'Warriors'  ",{"$nulls":3},"v","S.O. 'Three Swans' ",{"$nulls":3},"L",0,"L",0]
["Wk16","2019-01-17","Abingdon 'Knights'  ",{"$nulls":3},"v","Benson",{"$nulls":3},"L",0,{"$f":"IF(J65=\" \",\" \",IF(J65<4,\"L\",IF(J65=4,\"D\",\"W\")))","v":"L"},0]
["x",{"$nulls":10},"L",0,"L",0]
["Wk17","2019-01-21","Harwell 'Harlequins'",{"$nulls":3},"v","Abingdon 'Knights'  ",{"$nulls":3},"L",0,{"$f":"IF(J67=\" \",\" \",IF(J67<4,\"L\",IF(J67=4,\"D\",\"W\")))","v":"L"},0]
["Wk17","2019-01-23","Hanney",{"$nulls":3},"v","Wootton 'Warriors'  ",{"$nulls":3},{"$f":"IF(E68=\" \",\" \",IF(E68<4,\"L\",IF(E68=4,\"D\",\"W\")))","v":"L"},{"$f":"F68-K68","v":0},{"$f":"IF(J68=\" \",\" \",IF(J68<4,\"L\",IF(J68=4,\"D\",\"W\")))","v":"L"},{"$f":"K68-F68","v":0}]
["Wk17","2019-01-23","S.O. 'Three Swans' ",{"$nulls":3},"v","Harwell 'Hares'  ",{"$nulls":3},"L",0,{"$f":"IF(J69=\" \",\" \",IF(J69<4,\"L\",IF(J69=4,\"D\",\"W\")))","v":"L"},0]
["Wk17","2019-01-24","Didcot Bowls Club 'Hounds'",{"$nulls":3},"v","Challow 'Windymillers'  ",{"$nulls":3},"L",0,"L",0]
["x",{"$nulls":10},"L",0,"L",0]
["Wk18","2019-01-28","Harwell 'Hares'  ",{"$nulls":3},"v","Hanney",{"$nulls":3},"L",0,"L",0]
["Wk18","2019-01-28","S.O. 'Three Swans' ",{"$nulls":3},"v","Harwell 'Harlequins'",{"$nulls":3},"L",0,"L",0]
["Wk18","2019-01-31","Benson",{"$nulls":3},"v","Challow 'Windymillers'  ",{"$nulls":3},"L",0,"L",0]
["x",{"$nulls":10},"L",0,"L",0]
["Wk20","2019-02-13","Hanney",{"$nulls":3},"v","S.O. 'Three Swans' ",{"$nulls":3},"L",0,"L",0]
["Wk20","2019-02-14","Abingdon 'Knights'  ",{"$nulls":3},"v","Challow 'Windymillers'  ",{"$nulls":3},{"$f":"IF(E77=\" \",\" \",IF(E77<4,\"L\",IF(E77=4,\"D\",\"W\")))","v":"L"},{"$f":"F77-K77","v":0},"L",{"$f":"K77-F77","v":0}]
["Wk20","2019-02-14","Benson",{"$nulls":3},"v","Wootton 'Warriors'  ",{"$nulls":3},"L",0,{"$f":"IF(J78=\" \",\" \",IF(J78<4,\"L\",IF(J78=4,\"D\",\"W\")))","v":"L"},0]
["Wk20","2019-02-14","Didcot Bowls Club 'Hounds'",{"$nulls":3},"v","Harwell 'Hares'  ",{"$nulls":3},"L",0,"L",0]
["x",{"$nulls":10},"L",0,"L",0]
["Wk21","2019-02-18","Harwell 'Hares'  ",{"$nulls":3},"v","Benson",{"$nulls":3},"L",0,"L",0]
["Wk21","2019-02-18","S.O. 'Three Swans' ",{"$nulls":3},"v","Didcot Bowls Club 'Hounds'",{"$nulls":3},"L",0,"L",0]
["Wk21","2019-02-20","Hanney",{"$nulls":3},"v","Harwell 'Harlequins'",{"$nulls":3},"L",0,"L",0]
["Wk21","2019-02-20","Wootton 'Warriors'  ",{"$nulls":3},"v","Abingdon 'Knights'  ",{"$nulls":3},"L",0,"L",0]
["x",{"$nulls":10},"L",0,"L",0]
["Wk22","2019-02-25","Harwell 'Harlequins'",{"$nulls":3},"v","Challow 'Windymillers'  ",{"$nulls":3},"L",0,"L",0]
["Wk22","2019-02-28","Abingdon 'Knights'  ",{"$nulls":3},"v","Harwell 'Hares'  ",{"$nulls":3},"L",0,"L",0]
["Wk22","2019-02-28","Benson",{"$nulls":3},"v","S.O. 'Three Swans' ",{"$nulls":3},"L",0,"L",0]
["Wk22","2019-02-28","Didcot Bowls Club 'Hounds'",{"$nulls":3},"v","Hanney",{"$nulls":3},"L",0,"L",0]
["x",{"$nulls":10},"L",0,"L",0]
["Wk23","2019-03-05","Challow 'Windymillers'  ",{"$nulls":3},"v","S.O. 'Three Swans' ",{"$nulls":3},"L",0,"L",0]
["Wk23","2019-03-06","Wootton 'Warriors'  ",{"$nulls":3},"v","Didcot Bowls Club 'Hounds'",{"$nulls":3},{"$f":"IF(E92=\" \",\" \",IF(E92<4,\"L\",IF(E92=4,\"D\",\"W\")))","v":"L"},{"$f":"F92-K92","v":0},{"$f":"IF(J92=\" \",\" \",IF(J92<4,\"L\",IF(J92=4,\"D\",\"W\")))","v":"L"},{"$f":"K92-F92","v":0}]
["x",{"$nulls":10},"L",0,"L",0]
["Wk24","2019-03-11","S.O. 'Three Swans' ",{"$nulls":3},"v","Abingdon 'Knights'  ",{"$nulls":3},{"$f":"IF(E94=\" \",\" \",IF(E94<4,\"L\",IF(E94=4,\"D\",\"W\")))","v":"L"},{"$f":"F94-K94","v":0},{"$f":"IF(J94=\" \",\" \",IF(J94<4,\"L\",IF(J94=4,\"D\",\"W\")))","v":"L"},{"$f":"K94-F94","v":0}]
["Wk24","2019-03-13","Hanney",{"$nulls":3},"v","Benson",{"$nulls":3},{"$f":"IF(E95=\" \",\" \",IF(E95<4,\"L\",IF(E95=4,\"D\",\"W\")))","v":"L"},{"$f":"F95-K95","v":0},{"$f":"IF(J95=\" \",\" \",IF(J95<4,\"L\",IF(J95=4,\"D\",\"W\")))","v":"L"},{"$f":"K95-F95","v":0}]
["Wk24","2019-03-13","Wootton 'Warriors'  ",{"$nulls":3},"v","Challow 'Windymillers'  ",{"$nulls":3},"L",0,"L",0]
["Wk24","2019-03-14","Didcot Bowls Club 'Hounds'",{"$nulls":3},"v","Harwell 'Harlequins'",{"$nulls":3},"L",0,"L",0]
["x",{"$nulls":10},"L",0,"L",0]
["Wk25","2019-03-18","Harwell 'Harlequins'",{"$nulls":3},"v","Wootton 'Warriors'  ",{"$nulls":3},"L",0,"L",0]
["Wk25","2019-03-19","Challow 'Windymillers'  ",{"$nulls":3},"v","Harwell 'Hares'  ",{"$nulls":3},"L",0,{"$f":"IF(J100=\" \",\" \",IF(J100<4,\"L\",IF(J100=4,\"D\",\"W\")))","v":"L"},0]
["Wk25","2019-03-21","Abingdon 'Knights'  ",{"$nulls":3},"v","Hanney",{"$nulls":3},"L",0,{"$f":"IF(J101=\" \",\" \",IF(J101<4,\"L\",IF(J101=4,\"D\",\"W\")))","v":"L"},0]
["Wk25","2019-03-21","Benson",{"$nulls":3},"v","Didcot Bowls Club 'Hounds'",{"$nulls":3},"L",0,"L",0]
["x",{"$nulls":10},"L",0,"L",0]
["Wk26","2019-03-25","Harwell 'Hares'  ",{"$nulls":3},"v","Wootton 'Warriors'  ",{"$nulls":3},"L",0,"L",0]
["Wk26","2019-03-25","S.O. 'Three Swans' ",{"$nulls":3},"v","Challow 'Windymillers'  ",{"$nulls":3},"L",0,"L",0]
["Wk26","2019-03-27","Benson",{"$nulls":3},"v","Harwell 'Harlequins'",{"$nulls":3},"L",0,"L",0]
["Wk26","2019-03-28","Didcot Bowls Club 'Hounds'",{"$nulls":3},"v","Abingdon 'Knights'  ",{"$nulls":3},"L",0,{"$f":"IF(J107=\" \",\" \",IF(J107<4,\"L\",IF(J107=4,\"D\",\"W\")))","v":"L"},0]
["x",{"$nulls":10},"L",0,{"$f":"IF(J108=\" \",\" \",IF(J108<4,\"L\",IF(J108=4,\"D\",\"W\")))","v":"L"},0]
["x",{"$nulls":10},"W",0,"W",0]
["x",{"$nulls":10},"D",0,"D",0]
["x"]
["x"]
["x"]
["x"]
["x"]
["x"]
["x"]
["x"]
["x"]
["x"]
["x"]
["x"]
["x"]
["x"]
["x"]
["x"]
["x"]
["x"]
["x"]
["x"]
["x"]
["x"]
["x"]
["x"]
["x"]
["x"]
["x"]
["x"]
["x"]
["x"]
["x"]
["x"]
["x"]
["x"]
["x"]
["x"]
["x"]
["x"]
["x"]
["x"]
["x"]

{"sheet":"West Oxon","index":2,"n_rows":153,"n_cols":26,"rows_kept":153}
[{"$nulls":6},"West Oxon",{"$nulls":8},{"$f":"SUM(K5:K15)/8","v":{"v":55,"d":"55.0"}},{"$f":"INT(P1)","v":{"v":55,"d":"55.0"}}]
[{"$nulls":6},"Results For Season 2018-19"]
[{"$nulls":3},"Fixtures",{"$nulls":4},"Shots",{"$nulls":6},{"$f":"SUBTOTAL(9,P4:P15)/8","v":{"v":166,"d":"166.0"}},"Games"]
[null," ",null,"Play","W","D","L","For","Aga","Diff","Pts"]
[null,"Witney Mills 'The Weavers'",null,{"$f":"VLOOKUP($B5,$V$36:$Z$50,5,0)+VLOOKUP($B5,$V$21:$Z$33,5,0)","v":10},{"$f":"VLOOKUP($B5,$V$36:$Z$50,4,0)+VLOOKUP($B5,$V$21:$Z$33,4,0)","v":9},{"$f":"VLOOKUP($B5,$V$36:$Z$50,2,0)+VLOOKUP($B5,$V$21:$Z$33,2,0)","v":0},{"$f":"VLOOKUP($B5,$V$36:$Z$50,3,0)+VLOOKUP($B5,$V$21:$Z$33,3,0)","v":1},{"$f":"VLOOKUP($B5,$Q$21:$S$33,3,0)+VLOOKUP($B5,$Q$38:$S$50,3,0)","v":312},{"$f":"H5-J5","v":207},{"$f":"VLOOKUP($B5,$Q$21:$T$33,4,0)+VLOOKUP($B5,$Q$38:$T$50,4,0)","v":105},{"$f":"VLOOKUP($B5,$Q$21:$T$33,2,0)+VLOOKUP($B5,$Q$38:$T$50,2,0)","v":68},{"$nulls":4},{"$f":"(20-D5)*8+K5","v":148}]
[null,"North Leigh 'Millers' ",null,{"$f":"VLOOKUP($B6,$V$36:$Z$50,5,0)+VLOOKUP($B6,$V$21:$Z$33,5,0)","v":10},{"$f":"VLOOKUP($B6,$V$36:$Z$50,4,0)+VLOOKUP($B6,$V$21:$Z$33,4,0)","v":7},{"$f":"VLOOKUP($B6,$V$36:$Z$50,2,0)+VLOOKUP($B6,$V$21:$Z$33,2,0)","v":0},{"$f":"VLOOKUP($B6,$V$36:$Z$50,3,0)+VLOOKUP($B6,$V$21:$Z$33,3,0)","v":3},{"$f":"VLOOKUP($B6,$Q$21:$S$33,3,0)+VLOOKUP($B6,$Q$38:$S$50,3,0)","v":348},{"$f":"H6-J6","v":226},{"$f":"VLOOKUP($B6,$Q$21:$T$33,4,0)+VLOOKUP($B6,$Q$38:$T$50,4,0)","v":122},{"$f":"VLOOKUP($B6,$Q$21:$T$33,2,0)+VLOOKUP($B6,$Q$38:$T$50,2,0)","v":58},{"$nulls":4},138]
[null,"Burford 'Lions'  ",null,{"$f":"VLOOKUP($B7,$V$36:$Z$50,5,0)+VLOOKUP($B7,$V$21:$Z$33,5,0)","v":10},{"$f":"VLOOKUP($B7,$V$36:$Z$50,4,0)+VLOOKUP($B7,$V$21:$Z$33,4,0)","v":7},{"$f":"VLOOKUP($B7,$V$36:$Z$50,2,0)+VLOOKUP($B7,$V$21:$Z$33,2,0)","v":0},{"$f":"VLOOKUP($B7,$V$36:$Z$50,3,0)+VLOOKUP($B7,$V$21:$Z$33,3,0)","v":3},{"$f":"VLOOKUP($B7,$Q$21:$S$33,3,0)+VLOOKUP($B7,$Q$38:$S$50,3,0)","v":305},{"$f":"H7-J7","v":250},{"$f":"VLOOKUP($B7,$Q$21:$T$33,4,0)+VLOOKUP($B7,$Q$38:$T$50,4,0)","v":55},{"$f":"VLOOKUP($B7,$Q$21:$T$33,2,0)+VLOOKUP($B7,$Q$38:$T$50,2,0)","v":52},{"$nulls":4},132]
[null,"Witney Mills 'The Millers'",null,{"$f":"VLOOKUP($B8,$V$36:$Z$50,5,0)+VLOOKUP($B8,$V$21:$Z$33,5,0)","v":10},{"$f":"VLOOKUP($B8,$V$36:$Z$50,4,0)+VLOOKUP($B8,$V$21:$Z$33,4,0)","v":6},{"$f":"VLOOKUP($B8,$V$36:$Z$50,2,0)+VLOOKUP($B8,$V$21:$Z$33,2,0)","v":0},{"$f":"VLOOKUP($B8,$V$36:$Z$50,3,0)+VLOOKUP($B8,$V$21:$Z$33,3,0)","v":4},{"$f":"VLOOKUP($B8,$Q$21:$S$33,3,0)+VLOOKUP($B8,$Q$38:$S$50,3,0)","v":289},{"$f":"H8-J8","v":267},{"$f":"VLOOKUP($B8,$Q$21:$T$33,4,0)+VLOOKUP($B8,$Q$38:$T$50,4,0)","v":22},{"$f":"VLOOKUP($B8,$Q$21:$T$33,2,0)+VLOOKUP($B8,$Q$38:$T$50,2,0)","v":44},{"$nulls":4},124]
[null,"Hanborough 'Herons'  ",null,{"$f":"VLOOKUP($B9,$V$36:$Z$50,5,0)+VLOOKUP($B9,$V$21:$Z$33,5,0)","v":10},{"$f":"VLOOKUP($B9,$V$36:$Z$50,4,0)+VLOOKUP($B9,$V$21:$Z$33,4,0)","v":5},{"$f":"VLOOKUP($B9,$V$36:$Z$50,2,0)+VLOOKUP($B9,$V$21:$Z$33,2,0)","v":0},{"$f":"VLOOKUP($B9,$V$36:$Z$50,3,0)+VLOOKUP($B9,$V$21:$Z$33,3,0)","v":5},{"$f":"VLOOKUP($B9,$Q$21:$S$33,3,0)+VLOOKUP($B9,$Q$38:$S$50,3,0)","v":269},{"$f":"H9-J9","v":262},{"$f":"VLOOKUP($B9,$Q$21:$T$33,4,0)+VLOOKUP($B9,$Q$38:$T$50,4,0)","v":7},{"$f":"VLOOKUP($B9,$Q$21:$T$33,2,0)+VLOOKUP($B9,$Q$38:$T$50,2,0)","v":41},{"$nulls":4},121]
[null,"Witney Town 'Canaries' ",null,{"$f":"VLOOKUP($B10,$V$36:$Z$50,5,0)+VLOOKUP($B10,$V$21:$Z$33,5,0)","v":10},{"$f":"VLOOKUP($B10,$V$36:$Z$50,4,0)+VLOOKUP($B10,$V$21:$Z$33,4,0)","v":5},{"$f":"VLOOKUP($B10,$V$36:$Z$50,2,0)+VLOOKUP($B10,$V$21:$Z$33,2,0)","v":0},{"$f":"VLOOKUP($B10,$V$36:$Z$50,3,0)+VLOOKUP($B10,$V$21:$Z$33,3,0)","v":5},{"$f":"VLOOKUP($B10,$Q$21:$S$33,3,0)+VLOOKUP($B10,$Q$38:$S$50,3,0)","v":260},{"$f":"H10-J10","v":300},{"$f":"VLOOKUP($B10,$Q$21:$T$33,4,0)+VLOOKUP($B10,$Q$38:$T$50,4,0)","v":-40},{"$f":"VLOOKUP($B10,$Q$21:$T$33,2,0)+VLOOKUP($B10,$Q$38:$T$50,2,0)","v":36},{"$nulls":4},116]
[null,"Witney Town 'Rams' ",null,{"$f":"VLOOKUP($B11,$V$36:$Z$50,5,0)+VLOOKUP($B11,$V$21:$Z$33,5,0)","v":10},{"$f":"VLOOKUP($B11,$V$36:$Z$50,4,0)+VLOOKUP($B11,$V$21:$Z$33,4,0)","v":5},{"$f":"VLOOKUP($B11,$V$36:$Z$50,2,0)+VLOOKUP($B11,$V$21:$Z$33,2,0)","v":0},{"$f":"VLOOKUP($B11,$V$36:$Z$50,3,0)+VLOOKUP($B11,$V$21:$Z$33,3,0)","v":5},{"$f":"VLOOKUP($B11,$Q$21:$S$33,3,0)+VLOOKUP($B11,$Q$38:$S$50,3,0)","v":256},{"$f":"H11-J11","v":299},{"$f":"VLOOKUP($B11,$Q$21:$T$33,4,0)+VLOOKUP($B11,$Q$38:$T$50,4,0)","v":-43},{"$f":"VLOOKUP($B11,$Q$21:$T$33,2,0)+VLOOKUP($B11,$Q$38:$T$50,2,0)","v":36},{"$nulls":4},116]
[null,"Hanborough 'Harriers'  ",null,{"$f":"VLOOKUP($B12,$V$36:$Z$50,5,0)+VLOOKUP($B12,$V$21:$Z$33,5,0)","v":10},{"$f":"VLOOKUP($B12,$V$36:$Z$50,4,0)+VLOOKUP($B12,$V$21:$Z$33,4,0)","v":4},{"$f":"VLOOKUP($B12,$V$36:$Z$50,2,0)+VLOOKUP($B12,$V$21:$Z$33,2,0)","v":0},{"$f":"VLOOKUP($B12,$V$36:$Z$50,3,0)+VLOOKUP($B12,$V$21:$Z$33,3,0)","v":6},{"$f":"VLOOKUP($B12,$Q$21:$S$33,3,0)+VLOOKUP($B12,$Q$38:$S$50,3,0)","v":253},{"$f":"H12-J12","v":259},{"$f":"VLOOKUP($B12,$Q$21:$T$33,4,0)+VLOOKUP($B12,$Q$38:$T$50,4,0)","v":-6},{"$f":"VLOOKUP($B12,$Q$21:$T$33,2,0)+VLOOKUP($B12,$Q$38:$T$50,2,0)","v":35},{"$nulls":4},115]
[null,"Witney Town 'Woolies' ",null,{"$f":"VLOOKUP($B13,$V$36:$Z$50,5,0)+VLOOKUP($B13,$V$21:$Z$33,5,0)","v":9},{"$f":"VLOOKUP($B13,$V$36:$Z$50,4,0)+VLOOKUP($B13,$V$21:$Z$33,4,0)","v":3},{"$f":"VLOOKUP($B13,$V$36:$Z$50,2,0)+VLOOKUP($B13,$V$21:$Z$33,2,0)","v":0},{"$f":"VLOOKUP($B13,$V$36:$Z$50,3,0)+VLOOKUP($B13,$V$21:$Z$33,3,0)","v":6},{"$f":"VLOOKUP($B13,$Q$21:$S$33,3,0)+VLOOKUP($B13,$Q$38:$S$50,3,0)","v":211},{"$f":"H13-J13","v":268},{"$f":"VLOOKUP($B13,$Q$21:$T$33,4,0)+VLOOKUP($B13,$Q$38:$T$50,4,0)","v":-57},{"$f":"VLOOKUP($B13,$Q$21:$T$33,2,0)+VLOOKUP($B13,$Q$38:$T$50,2,0)","v":28},{"$nulls":4},116]
[null,"Charlbury 'Willows'  ",null,{"$f":"VLOOKUP($B14,$V$36:$Z$50,5,0)+VLOOKUP($B14,$V$21:$Z$33,5,0)","v":10},{"$f":"VLOOKUP($B14,$V$36:$Z$50,4,0)+VLOOKUP($B14,$V$21:$Z$33,4,0)","v":2},{"$f":"VLOOKUP($B14,$V$36:$Z$50,2,0)+VLOOKUP($B14,$V$21:$Z$33,2,0)","v":1},{"$f":"VLOOKUP($B14,$V$36:$Z$50,3,0)+VLOOKUP($B14,$V$21:$Z$33,3,0)","v":7},{"$f":"VLOOKUP($B14,$Q$21:$S$33,3,0)+VLOOKUP($B14,$Q$38:$S$50,3,0)","v":249},{"$f":"H14-J14","v":310},{"$f":"VLOOKUP($B14,$Q$21:$T$33,4,0)+VLOOKUP($B14,$Q$38:$T$50,4,0)","v":-61},{"$f":"VLOOKUP($B14,$Q$21:$T$33,2,0)+VLOOKUP($B14,$Q$38:$T$50,2,0)","v":26},{"$nulls":4},106]
[null,"Charlbury 'Oaks'  ",null,{"$f":"VLOOKUP($B15,$V$36:$Z$50,5,0)+VLOOKUP($B15,$V$21:$Z$33,5,0)","v":10},{"$f":"VLOOKUP($B15,$V$36:$Z$50,4,0)+VLOOKUP($B15,$V$21:$Z$33,4,0)","v":1},{"$f":"VLOOKUP($B15,$V$36:$Z$50,2,0)+VLOOKUP($B15,$V$21:$Z$33,2,0)","v":1},{"$f":"VLOOKUP($B15,$V$36:$Z$50,3,0)+VLOOKUP($B15,$V$21:$Z$33,3,0)","v":8},{"$f":"VLOOKUP($B15,$Q$21:$S$33,3,0)+VLOOKUP($B15,$Q$38:$S$50,3,0)","v":245},{"$f":"H15-J15","v":326},{"$f":"VLOOKUP($B15,$Q$21:$T$33,4,0)+VLOOKUP($B15,$Q$38:$T$50,4,0)","v":-81},{"$f":"VLOOKUP($B15,$Q$21:$T$33,2,0)+VLOOKUP($B15,$Q$38:$T$50,2,0)","v":16},{"$nulls":4},96]
[]
[null,"DATE","Home",".","Pts","Sht","v","Away",".","Pts","Sht","Result","Diff","Result","Diff",{"$nulls":6},"Sht","(All)"]
["Wk 2","2018-10-02","Charlbury 'Willows'  ",null,0,18,"v","Witney Town 'Canaries' ",null,8,31,{"$f":"IF(E18=\" \",\" \",IF(E18<4,\"L\",IF(E18=4,\"D\",\"W\")))","v":"L"},{"$f":"F18-K18","v":-13},{"$f":"IF(J18=\" \",\" \",IF(J18<4,\"L\",IF(J18=4,\"D\",\"W\")))","v":"W"},{"$f":"K18-F18","v":13},null,"Home"]
["Wk 2","2018-10-02","Hanborough 'Herons'  ",null,8,28,"v","Witney Mills 'The Millers'",null,0,20,"W",8,{"$f":"IF(J19=\" \",\" \",IF(J19<4,\"L\",IF(J19=4,\"D\",\"W\")))","v":"L"},-8,null,null,"Values",{"$nulls":3},"Count of Pts","Column Labels"]
["Wk 2","2018-10-02","Witney Mills 'The Weavers'",null,8,26,"v","Hanborough 'Harriers'  ",null,0,20,"W",6,"L",-6,null,"Row Labels","Sum of Pts","Sum of Sht","Sum of Diff",null,"Row Labels","D","L","W","Grand Total"]
["Wk 2","2018-10-02","Witney Town 'Rams' ",null,6,36,"v","Charlbury 'Oaks'  ",null,2,26,"W",10,"L",-10,null,"Burford 'Lions'  ",30,148,69,null,"Burford 'Lions'  ",null,null,4,4]
["Wk 2","2018-10-03","Witney Town 'Woolies' ",null,2,20,"v","Burford 'Lions'  ",null,6,34,"L",-14,"W",14,null,"Charlbury 'Oaks'  ",5,103,-13,null,"Charlbury 'Oaks'  ",1,3,null,4]
["x",{"$nulls":10},"L",0,"L",0,null,"Charlbury 'Willows'  ",14,135,-4,null,"Charlbury 'Willows'  ",null,4,1,5]
["Wk 3","2018-10-09","Burford 'Lions'  ",null,8,34,"v","North Leigh 'Millers' ",null,0,24,"W",10,"L",-10,null,"Hanborough 'Harriers'  ",20,133,6,null,"Hanborough 'Harriers'  ",null,3,2,5]
["Wk 3","2018-10-09","Hanborough 'Harriers'  ",null,0,13,"v","Hanborough 'Herons'  ",null,8,28,"L",-15,"W",15,null,"Hanborough 'Herons'  ",23,165,5,null,"Hanborough 'Herons'  ",null,3,3,6]
["Wk 3","2018-10-09","Witney Mills 'The Millers'",null,8,35,"v","Witney Town 'Canaries' ",null,0,19,"W",16,"L",-16,null,"North Leigh 'Millers' ",40,200,114,null,"North Leigh 'Millers' ",null,null,5,5]
["Wk 3","2018-10-09","Witney Town 'Rams' ",null,2,23,"v","Witney Mills 'The Weavers'",null,6,29,"L",-6,"W",6,null,"Witney Mills 'The Millers'",36,179,79,null,"Witney Mills 'The Millers'",null,null,5,5]
["x",{"$nulls":10},"L",0,"L",0,null,"Witney Mills 'The Weavers'",40,197,77,null,"Witney Mills 'The Weavers'",null,1,5,6]
["Wk 4","2018-10-16","Charlbury 'Willows'  ",null,2,27,"v","Burford 'Lions'  ",null,6,30,"L",-3,"W",3,null,"Witney Town 'Canaries' ",16,114,4,null,"Witney Town 'Canaries' ",null,2,2,4]
["Wk 4","2018-10-16","Hanborough 'Herons'  ",null,2,23,"v","Witney Town 'Rams' ",null,6,26,"L",-3,"W",3,null,"Witney Town 'Rams' ",24,160,-17,null,"Witney Town 'Rams' ",null,3,3,6]
["Wk 4","2018-10-17","North Leigh 'Millers' ",null,8,42,"v","Charlbury 'Oaks'  ",null,0,17,"W",25,"L",-25,null,"Witney Town 'Woolies' ",18,125,-19,null,"Witney Town 'Woolies' ",null,3,2,5]
["x",{"$nulls":10},"L",0,"L",0,null,"(blank)",null,null,0,null,"(blank)"]
["Wk 5","2018-10-23","Charlbury 'Oaks'  ",null,4,34,"v","Charlbury 'Willows'  ",null,4,34,"D",0,"D",0,null,"Grand Total",266,1659,301,null,"Grand Total",1,22,32,55]
["Wk 5","2018-10-23","Hanborough 'Harriers'  ",null,2,24,"v","Witney Mills 'The Millers'",null,6,32,"L",-8,"W",8]
["Wk 5","2018-10-23","Witney Mills 'The Weavers'",null,2,25,"v","Hanborough 'Herons'  ",null,6,26,"L",-1,"W",1]
["Wk 5","2018-10-23","Witney Town 'Rams' ",null,0,11,"v","North Leigh 'Millers' ",null,8,44,"L",-33,"W",33,null,null,"Values",{"$nulls":3},"Count of Pts","Column Labels"]
["Wk 5","2018-10-24","Witney Town 'Woolies' ",null,2,25,"v","Witney Town 'Canaries' ",null,6,31,"L",-6,"W",6,null,"Row Labels","Sum of Pts","Sum of Sht","Sum of Diff2",null,"Row Labels","D","L","W","Grand Total"]
["x",{"$nulls":10},"L",0,"L",0,null,"Burford 'Lions'  ",22,157,-14,null,"Burford 'Lions'  ",null,3,3,6]
["Wk 6","2018-10-30","Charlbury 'Willows'  ",null,2,21,"v","Witney Town 'Rams' ",null,6,31,"L",-10,"W",10,null,"Charlbury 'Oaks'  ",11,142,-68,null,"Charlbury 'Oaks'  ",null,5,1,6]
["Wk 6","2018-10-30","Hanborough 'Herons'  ",null,6,26,"v","Burford 'Lions'  ",null,2,25,"W",1,"L",-1,null,"Charlbury 'Willows'  ",12,114,-57,null,"Charlbury 'Willows'  ",1,3,1,5]
["Wk 6","2018-10-30","Witney Mills 'The Millers'",null,6,25,"v","Witney Town 'Woolies' ",null,2,25,"W",0,"L",0,null,"Hanborough 'Harriers'  ",15,120,-12,null,"Hanborough 'Harriers'  ",null,3,2,5]
["Wk 6","2018-10-30","Witney Town 'Canaries' ",null,8,33,"v","Charlbury 'Oaks'  ",null,0,30,"W",3,"L",-3,null,"Hanborough 'Herons'  ",18,104,2,null,"Hanborough 'Herons'  ",null,2,2,4]
["Wk 6","2018-10-31","North Leigh 'Millers' ",null,8,32,"v","Hanborough 'Harriers'  ",null,0,22,"W",10,"L",-10,null,"North Leigh 'Millers' ",18,148,8,null,"North Leigh 'Millers' ",null,3,2,5]
["x",{"$nulls":10},"L",0,"L",0,null,"Town 'Woolies'  ",0,20,-23,null,"Town 'Woolies'  ",null,1,null,1]
["Wk 7","2018-11-06","Witney Mills 'The Weavers'",null,8,44,"v","Witney Town 'Woolies' ",null,0,12,"W",32,"L",-32,null,"Witney Mills 'The Millers'",8,110,-57,null,"Witney Mills 'The Millers'",null,4,1,5]
["Wk 7","2018-11-07","Witney Town 'Woolies' ",null,2,27,"v","Charlbury 'Willows'  ",null,6,28,"L",-1,"W",1,null,"Witney Mills 'The Weavers'",28,115,28,null,"Witney Mills 'The Weavers'",null,null,4,4]
["x",{"$nulls":10},"L",0,"L",0,null,"Witney Town 'Canaries' ",20,146,-44,null,"Witney Town 'Canaries' ",null,3,3,6]
["Wk 8","2018-11-13","Burford 'Lions'  ",null,8,42,"v","Witney Town 'Canaries' ",null,0,16,"W",26,"L",-26,null,"Witney Town 'Rams' ",12,96,-26,null,"Witney Town 'Rams' ",null,2,2,4]
["Wk 8","2018-11-13","Charlbury 'Oaks'  ",null,1,23,"v","Hanborough 'Harriers'  ",null,7,26,"L",-3,"W",3,null,"Witney Town 'Woolies' ",10,86,-38,null,"Witney Town 'Woolies' ",null,3,1,4]
["Wk 8","2018-11-13","Hanborough 'Herons'  ",null,6,35,"v","Charlbury 'Willows'  ",null,2,26,{"$f":"IF(E50=\" \",\" \",IF(E50<4,\"L\",IF(E50=4,\"D\",\"W\")))","v":"W"},{"$f":"F50-K50","v":9},"L",{"$f":"K50-F50","v":-9},null,"(blank)",null,null,0,null,"(blank)"]
["Wk 8","2018-11-13","Witney Mills 'The Weavers'",null,8,31,"v","North Leigh 'Millers' ",null,0,25,"W",6,"L",-6,null,"Grand Total",174,1358,-301,null,"Grand Total",1,32,22,55]
["Wk 8","2018-11-13","Witney Town 'Rams' ",null,6,30,"v","Witney Mills 'The Millers'",null,2,24,"W",6,"L",-6]
["x",{"$nulls":10},"L",0,"L",0]
["Wk 9","2018-11-20","Charlbury 'Willows'  ",null,2,20,"v","Witney Mills 'The Weavers'",null,6,28,"L",-8,"W",8]
["Wk 9","2018-11-20","Hanborough 'Harriers'  ",null,2,24,"v","Burford 'Lions'  ",null,6,31,"L",-7,"W",7]
["Wk 9","2018-11-20","Witney Mills 'The Millers'",null,8,42,"v","Charlbury 'Oaks'  ",null,0,18,"W",24,"L",-24]
["Wk 9","2018-11-20","Witney Town 'Canaries' ",null,6,36,"v","Hanborough 'Herons'  ",null,2,23,"W",13,"L",-13]
["Wk 9","2018-11-21","North Leigh 'Millers' ",null,8,43,"v","Town 'Woolies'  ",null,0,20,"W",23,"L",-23]
["x",{"$nulls":10},"L",0,"L",0]
["Wk10","2018-11-27","Burford 'Lions'  ",null,6,30,"v","Charlbury 'Oaks'  ",null,2,20,"W",10,"L",-10]
["Wk10","2018-11-27","Hanborough 'Herons'  ",null,0,26,"v","North Leigh 'Millers' ",null,8,32,"L",-6,"W",6]
["Wk10","2018-11-27","Witney Mills 'The Weavers'",null,8,36,"v","Witney Mills 'The Millers'",null,0,15,"W",21,"L",-21]
["Wk10","2018-11-27","Witney Town 'Rams' ",null,2,26,"v","Witney Town 'Canaries' ",null,6,32,"L",-6,"W",6]
["Wk10","2018-11-28","Witney Town 'Woolies' ",null,6,25,"v","Hanborough 'Harriers'  ",null,2,24,"W",1,"L",-1]
["x",{"$nulls":10},"L",0,"L",0]
["Wk11","2018-12-04","Charlbury 'Oaks'  ",null,0,21,"v","Witney Town 'Woolies' ",null,8,27,"L",-6,"W",6]
["Wk11","2018-12-04","Hanborough 'Harriers'  ",null,8,36,"v","Witney Town 'Rams' ",null,0,20,"W",16,"L",-16]
["Wk11","2018-12-04","Witney Mills 'The Millers'",null,8,39,"v","Burford 'Lions'  ",null,0,15,"W",24,"L",-24]
["Wk11","2018-12-04","Witney Town 'Canaries' ",null,0,19,"v","Witney Mills 'The Weavers'",null,8,29,"L",-10,{"$f":"IF(J69=\" \",\" \",IF(J69<4,\"L\",IF(J69=4,\"D\",\"W\")))","v":"W"},10]
["Wk11","2018-12-05","North Leigh 'Millers' ",null,8,39,"v","Charlbury 'Willows'  ",null,0,10,"W",29,"L",-29]
["x",{"$nulls":10},"L",0,{"$f":"IF(J71=\" \",\" \",IF(J71<4,\"L\",IF(J71=4,\"D\",\"W\")))","v":"L"},0]
["Wk12","2018-12-11","Charlbury 'Willows'  ",null,8,49,"v","Witney Mills 'The Millers'",null,0,19,"W",30,{"$f":"IF(J72=\" \",\" \",IF(J72<4,\"L\",IF(J72=4,\"D\",\"W\")))","v":"L"},-30]
["Wk12","2018-12-11","Hanborough 'Herons'  ",null,1,27,"v","Charlbury 'Oaks'  ",null,7,31,"L",-4,"W",4]
["Wk12","2018-12-11","Witney Mills 'The Weavers'",null,6,35,"v","Burford 'Lions'  ",null,2,22,"W",13,"L",-13]
["Wk12","2018-12-11","Witney Town 'Rams' ",null,8,34,"v","Witney Town 'Woolies' ",null,0,22,"W",12,"L",-12]
["Wk12","2018-12-12","North Leigh 'Millers' ",null,8,44,"v","Witney Town 'Canaries' ",null,0,17,"W",27,"L",-27]
["x",{"$nulls":10},{"$f":"IF(E77=\" \",\" \",IF(E77<4,\"L\",IF(E77=4,\"D\",\"W\")))","v":"L"},{"$f":"F77-K77","v":0},{"$f":"IF(J77=\" \",\" \",IF(J77<4,\"L\",IF(J77=4,\"D\",\"W\")))","v":"L"},{"$f":"K77-F77","v":0}]
["Wk13","2018-12-18","Witney Town 'Canaries' ",null,2,26,"v","Hanborough 'Harriers'  ",null,6,28,"L",-2,"W",2]
["x",{"$nulls":10},"L",0,"L",0]
["Wk15","2019-01-08","Burford 'Lions'  ",null,8,42,"v","Witney Town 'Rams' ",null,0,19,"W",23,"L",-23]
["Wk15","2019-01-08","Charlbury 'Oaks'  ",null,0,25,"v","Witney Mills 'The Weavers'",null,8,29,{"$f":"IF(E81=\" \",\" \",IF(E81<4,\"L\",IF(E81=4,\"D\",\"W\")))","v":"L"},{"$f":"F81-K81","v":-4},"W",{"$f":"K81-F81","v":4}]
["Wk15","2019-01-08","Hanborough 'Harriers'  ",null,8,36,"v","Charlbury 'Willows'  ",null,0,16,"W",20,"L",-20]
["Wk15","2019-01-08","Witney Mills 'The Millers'",null,6,38,"v","North Leigh 'Millers' ",null,2,23,"W",15,"L",-15]
["Wk15","2019-01-09","Witney Town 'Woolies' ",null,6,28,"v","Hanborough 'Herons'  ",null,2,27,"W",1,{"$f":"IF(J84=\" \",\" \",IF(J84<4,\"L\",IF(J84=4,\"D\",\"W\")))","v":"L"},-1]
["x",{"$nulls":10},"L",0,"L",0]
["Wk16","2019-01-15","Charlbury 'Willows'  ",{"$nulls":3},"v","Hanborough 'Harriers'  ",{"$nulls":3},"L",0,"L",0]
["Wk16","2019-01-15","Hanborough 'Herons'  ",{"$nulls":3},"v","Witney Town 'Woolies' ",{"$nulls":3},"L",0,"L",0]
["Wk16","2019-01-15","Witney Mills 'The Weavers'",{"$nulls":3},"v","Charlbury 'Oaks'  ",{"$nulls":3},"L",0,"L",0]
["Wk16","2019-01-15","Witney Town 'Rams' ",{"$nulls":3},"v","Burford 'Lions'  ",{"$nulls":3},"L",0,"L",0]
["Wk16","2019-01-16","North Leigh 'Millers' ",{"$nulls":3},"v","Witney Mills 'The Millers'",{"$nulls":3},"L",0,"L",0]
["x",{"$nulls":10},"L",0,"L",0]
["Wk17","2019-01-22","Burford 'Lions'  ",{"$nulls":3},"v","Witney Mills 'The Weavers'",{"$nulls":3},"L",0,"L",0]
["Wk17","2019-01-22","Charlbury 'Oaks'  ",{"$nulls":3},"v","Hanborough 'Herons'  ",{"$nulls":3},"L",0,"L",0]
["Wk17","2019-01-22","Witney Mills 'The Millers'",{"$nulls":3},"v","Charlbury 'Willows'  ",{"$nulls":3},"L",0,"L",0]
["x",{"$nulls":10},"L",0,"L",0]
["Wk18","2019-01-29","Charlbury 'Willows'  ",{"$nulls":3},"v","Witney Town 'Woolies' ",{"$nulls":3},"L",0,"L",0]
["Wk18","2019-01-29","Hanborough 'Herons'  ",{"$nulls":3},"v","Hanborough 'Harriers'  ",{"$nulls":3},"L",0,"L",0]
["Wk18","2019-01-29","Witney Mills 'The Weavers'",{"$nulls":3},"v","Witney Town 'Rams' ",{"$nulls":3},"L",0,"L",0]
["Wk18","2019-01-29","Witney Town 'Canaries' ",{"$nulls":3},"v","Witney Mills 'The Millers'",{"$nulls":3},"L",0,"L",0]
["Wk18","2019-01-30","North Leigh 'Millers' ",{"$nulls":3},"v","Burford 'Lions'  ",{"$nulls":3},"L",0,{"$f":"IF(J100=\" \",\" \",IF(J100<4,\"L\",IF(J100=4,\"D\",\"W\")))","v":"L"},0]
["x",{"$nulls":10},"L",0,{"$f":"IF(J101=\" \",\" \",IF(J101<4,\"L\",IF(J101=4,\"D\",\"W\")))","v":"L"},0]
["Wk19","2019-02-05","Burford 'Lions'  ",{"$nulls":3},"v","Charlbury 'Willows'  ",{"$nulls":3},"L",0,"L",0]
["Wk19","2019-02-05","Charlbury 'Oaks'  ",{"$nulls":3},"v","North Leigh 'Millers' ",{"$nulls":3},"L",0,"L",0]
["Wk19","2019-02-05","Hanborough 'Harriers'  ",{"$nulls":3},"v","Witney Town 'Canaries' ",{"$nulls":3},"L",0,{"$f":"IF(J104=\" \",\" \",IF(J104<4,\"L\",IF(J104=4,\"D\",\"W\")))","v":"L"},0]
["Wk19","2019-02-05","Witney Town 'Rams' ",{"$nulls":3},"v","Hanborough 'Herons'  ",{"$nulls":3},"L",0,{"$f":"IF(J105=\" \",\" \",IF(J105<4,\"L\",IF(J105=4,\"D\",\"W\")))","v":"L"},0]
["Wk19","2019-02-06","Witney Town 'Woolies' ",{"$nulls":3},"v","Witney Mills 'The Weavers'",{"$nulls":3},"L",0,{"$f":"IF(J106=\" \",\" \",IF(J106<4,\"L\",IF(J106=4,\"D\",\"W\")))","v":"L"},0]
["x",{"$nulls":10},{"$f":"IF(E107=\" \",\" \",IF(E107<4,\"L\",IF(E107=4,\"D\",\"W\")))","v":"L"},{"$f":"F107-K107","v":0},{"$f":"IF(J107=\" \",\" \",IF(J107<4,\"L\",IF(J107=4,\"D\",\"W\")))","v":"L"},{"$f":"K107-F107","v":0}]
["Wk20","2019-02-12","Witney Town 'Canaries' ",{"$nulls":3},"v","North Leigh 'Millers' ",{"$nulls":3},"L",0,"L",0]
["Wk20","2019-02-13","Witney Town 'Woolies' ",{"$nulls":3},"v","Witney Town 'Rams' ",{"$nulls":3},"L",0,"L",0]
["x",{"$nulls":10},"L",0,"L",0]
["Wk21","2019-02-19","Charlbury 'Willows'  ",{"$nulls":3},"v","Charlbury 'Oaks'  ",{"$nulls":3},"L",0,"L",0]
["Wk21","2019-02-19","Hanborough 'Herons'  ",{"$nulls":3},"v","Witney Mills 'The Weavers'",{"$nulls":3},"L",0,"L",0]
["Wk21","2019-02-19","Witney Mills 'The Millers'",{"$nulls":3},"v","Hanborough 'Harriers'  ",{"$nulls":3},"L",0,"L",0]
["Wk21","2019-02-19","Witney Town 'Canaries' ",{"$nulls":3},"v","Witney Town 'Woolies' ",{"$nulls":3},{"$f":"IF(E114=\" \",\" \",IF(E114<4,\"L\",IF(E114=4,\"D\",\"W\")))","v":"L"},{"$f":"F114-K114","v":0},{"$f":"IF(J114=\" \",\" \",IF(J114<4,\"L\",IF(J114=4,\"D\",\"W\")))","v":"L"},{"$f":"K114-F114","v":0}]
["Wk21","2019-02-20","North Leigh 'Millers' ",{"$nulls":3},"v","Witney Town 'Rams' ",{"$nulls":3},"L",0,"L",0]
["x",{"$nulls":10},"L",0,"L",0]
["Wk22","2019-02-26","Burford 'Lions'  ",{"$nulls":3},"v","Hanborough 'Herons'  ",{"$nulls":3},"L",0,"L",0]
["Wk22","2019-02-26","Charlbury 'Oaks'  ",{"$nulls":3},"v","Witney Town 'Canaries' ",{"$nulls":3},"L",0,"L",0]
["Wk22","2019-02-26","Hanborough 'Harriers'  ",{"$nulls":3},"v","North Leigh 'Millers' ",{"$nulls":3},"L",0,"L",0]
["Wk22","2019-02-26","Witney Town 'Rams' ",{"$nulls":3},"v","Charlbury 'Willows'  ",{"$nulls":3},"L",0,"L",0]
["Wk22","2019-02-27","Witney Town 'Woolies' ",{"$nulls":3},"v","Witney Mills 'The Millers'",{"$nulls":3},"L",0,"L",0]
["x",{"$nulls":10},"L",0,"L",0]
["Wk23","2019-03-05","Charlbury 'Willows'  ",{"$nulls":3},"v","Hanborough 'Herons'  ",{"$nulls":3},"L",0,"L",0]
["Wk23","2019-03-05","Hanborough 'Harriers'  ",{"$nulls":3},"v","Charlbury 'Oaks'  ",{"$nulls":3},"L",0,"L",0]
["Wk23","2019-03-05","Witney Mills 'The Millers'",{"$nulls":3},"v","Witney Town 'Rams' ",{"$nulls":3},"L",0,"L",0]
["Wk23","2019-03-05","Witney Town 'Canaries' ",{"$nulls":3},"v","Burford 'Lions'  ",{"$nulls":3},"L",0,"L",0]
["Wk23","2019-03-06","North Leigh 'Millers' ",{"$nulls":3},"v","Witney Mills 'The Weavers'",{"$nulls":3},"L",0,"L",0]
["x",{"$nulls":10},"L",0,{"$f":"IF(J128=\" \",\" \",IF(J128<4,\"L\",IF(J128=4,\"D\",\"W\")))","v":"L"},0]
["Wk24","2019-03-12","Burford 'Lions'  ",{"$nulls":3},"v","Hanborough 'Harriers'  ",{"$nulls":3},"L",0,"L",0]
["Wk24","2019-03-12","Charlbury 'Oaks'  ",{"$nulls":3},"v","Witney Mills 'The Millers'",{"$nulls":3},"L",0,"L",0]
["Wk24","2019-03-12","Hanborough 'Herons'  ",{"$nulls":3},"v","Witney Town 'Canaries' ",{"$nulls":3},"L",0,"L",0]
["Wk24","2019-03-12","Witney Mills 'The Weavers'",{"$nulls":3},"v","Charlbury 'Willows'  ",{"$nulls":3},"L",0,"L",0]
["Wk24","2019-03-13","Witney Town 'Woolies' ",{"$nulls":3},"v","North Leigh 'Millers' ",{"$nulls":3},"L",0,"L",0]
["x",{"$nulls":10},"L",0,"L",0]
["Wk25","2019-03-19","Charlbury 'Oaks'  ",{"$nulls":3},"v","Burford 'Lions'  ",{"$nulls":3},"L",0,"L",0]
["Wk25","2019-03-19","Hanborough 'Harriers'  ",{"$nulls":3},"v","Witney Town 'Woolies' ",{"$nulls":3},"L",0,"L",0]
["Wk25","2019-03-19","Witney Mills 'The Millers'",{"$nulls":3},"v","Witney Mills 'The Weavers'",{"$nulls":3},"L",0,"L",0]
["Wk25","2019-03-19","Witney Town 'Canaries' ",{"$nulls":3},"v","Witney Town 'Rams' ",{"$nulls":3},"L",0,"L",0]
["Wk25","2019-03-20","North Leigh 'Millers' ",{"$nulls":3},"v","Hanborough 'Herons'  ",{"$nulls":3},"L",0,"L",0]
["x",{"$nulls":10},"L",0,"L",0]
["Wk26","2019-03-26","Burford 'Lions'  ",{"$nulls":3},"v","Witney Mills 'The Millers'",{"$nulls":3},"L",0,"L",0]
["Wk26","2019-03-26","Charlbury 'Willows'  ",{"$nulls":3},"v","North Leigh 'Millers' ",{"$nulls":3},"L",0,"L",0]
["Wk26","2019-03-26","Witney Mills 'The Weavers'",{"$nulls":3},"v","Witney Town 'Canaries' ",{"$nulls":3},"L",0,"L",0]
["Wk26","2019-03-26","Witney Town 'Rams' ",{"$nulls":3},"v","Hanborough 'Harriers'  ",{"$nulls":3},"L",0,"L",0]
["Wk26","2019-03-27","Witney Town 'Woolies' ",{"$nulls":3},"v","Charlbury 'Oaks'  ",{"$nulls":3},"L",0,"L",0]
["x",{"$nulls":10},"L",{"$f":"F146-K146","v":0},"L",{"$f":"K146-F146","v":0}]
["Wk27","2019-04-02","Burford 'Lions'  ",{"$nulls":3},"v","Witney Town 'Woolies' ",{"$nulls":3},"L",0,"L",0]
["Wk27","2019-04-02","Charlbury 'Oaks'  ",{"$nulls":3},"v","Witney Town 'Rams' ",{"$nulls":3},"L",0,"L",0]
["Wk27","2019-04-02","Hanborough 'Harriers'  ",{"$nulls":3},"v","Witney Mills 'The Weavers'",{"$nulls":3},"L",0,"L",0]
["Wk27","2019-04-02","Witney Mills 'The Millers'",{"$nulls":3},"v","Hanborough 'Herons'  ",{"$nulls":3},"L",0,{"$f":"IF(J150=\" \",\" \",IF(J150<4,\"L\",IF(J150=4,\"D\",\"W\")))","v":"L"},0]
["Wk27","2019-04-02","Witney Town 'Canaries' ",{"$nulls":3},"v","Charlbury 'Willows'  ",{"$nulls":3},{"$f":"IF(E151=\" \",\" \",IF(E151<4,\"L\",IF(E151=4,\"D\",\"W\")))","v":"L"},{"$f":"F151-K151","v":0},{"$f":"IF(J151=\" \",\" \",IF(J151<4,\"L\",IF(J151=4,\"D\",\"W\")))","v":"L"},{"$f":"K151-F151","v":0}]
[{"$nulls":11},"W",0,"W",0]
[{"$nulls":11},"D",{"$f":"F153-K153","v":0},"D",{"$f":"K153-F153","v":0}]

{"sheet":"Afternoon Div 1","index":3,"n_rows":151,"n_cols":26,"rows_kept":151}
[{"$nulls":6},"Afternoon - Division One",{"$nulls":8},{"$f":"SUM(K5:K14)/8","v":{"v":35,"d":"35.0"}},{"$f":"INT(P1)","v":{"v":35,"d":"35.0"}}]
[{"$nulls":6},"Results For Season 2018-19"]
[{"$nulls":3},"Fixtures",{"$nulls":4},"Shots",{"$nulls":6},{"$f":"SUBTOTAL(9,P4:P13)/8","v":{"v":109,"d":"109.0"}},"Games"]
[null," ",null,"Play","W","D","L","For","Aga","Diff","Pts"]
[null,"Drayton 'Wasps'",null,{"$f":"VLOOKUP($B5,$V$34:$Z$48,5,0)+VLOOKUP($B5,$V$19:$Z$31,5,0)","v":8},{"$f":"VLOOKUP($B5,$V$34:$Z$48,4,0)+VLOOKUP($B5,$V$19:$Z$31,4,0)","v":7},{"$f":"VLOOKUP($B5,$V$34:$Z$48,2,0)+VLOOKUP($B5,$V$19:$Z$31,2,0)","v":0},{"$f":"VLOOKUP($B5,$V$34:$Z$48,3,0)+VLOOKUP($B5,$V$19:$Z$31,3,0)","v":1},{"$f":"VLOOKUP($B5,$Q$19:$S$31,3,0)+VLOOKUP($B5,$Q$36:$S$48,3,0)","v":218},{"$f":"H5-J5","v":146},{"$f":"VLOOKUP($B5,$Q$19:$T$31,4,0)+VLOOKUP($B5,$Q$36:$T$48,4,0)","v":72},{"$f":"VLOOKUP($B5,$Q$19:$T$31,2,0)+VLOOKUP($B5,$Q$36:$T$48,2,0)","v":51},{"$nulls":4},{"$f":"(16-D5)*8+K5","v":115}]
[null,"Didcot Bowls Club 'Red Kites'",null,8,6,0,2,185,161,24,46,{"$nulls":4},{"$f":"(16-D6)*8+K6","v":110}]
[null,"Abingdon 'Park Rangers'",null,8,5,0,3,207,168,39,40,{"$nulls":4},104]
[null,"Aston 'Astons'",null,8,4,0,4,179,166,13,30,{"$nulls":4},94]
[null,"Harwell 'Eagles'",null,8,4,0,4,190,194,-4,27,{"$nulls":4},91]
[null,"Benson SMBC",null,8,3,0,5,154,174,-20,25,{"$nulls":4},89]
[null,"Woodcote 'Wings'",null,7,2,0,5,148,160,-12,22,{"$nulls":4},94]
[null,"Stanford 'Blues'",null,7,2,0,5,123,178,-55,20,{"$nulls":4},92]
[null,"Kingston 'Kites'",null,8,2,0,6,147,204,-57,19,{"$nulls":4},83]
[]
[null,"DATE","Home",".","Pts","Sht","v","Away",".","Pts","Sht","Result","Diff","Result","Diff",{"$nulls":6},"Sht","(All)"]
["Wk 1","2018-09-26","Aston 'Astons'",null,0,13,"v","Stanford 'Blues'",null,8,24,{"$f":"IF(E16=\" \",\" \",IF(E16<4,\"L\",IF(E16=4,\"D\",\"W\")))","v":"L"},{"$f":"F16-K16","v":-11},{"$f":"IF(J16=\" \",\" \",IF(J16<4,\"L\",IF(J16=4,\"D\",\"W\")))","v":"W"},{"$f":"K16-F16","v":11},null,"Home"]
["x",{"$nulls":10},"L",0,"L",0,null,null,"Values",{"$nulls":3},"Count of Pts","Column Labels"]
["Wk 2","2018-10-03","Kingston 'Kites'",null,8,26,"v","Benson SMBC",null,0,13,"W",13,"L",-13,null,"Row Labels","Sum of Pts","Sum of Sht","Sum of Diff",null,"Row Labels","D","L","W","Grand Total"]
["Wk 2","2018-10-04","Harwell 'Eagles'",null,0,19,"v","Drayton 'Wasps'",null,8,40,"L",-21,"W",21,null,"Abingdon 'Park Rangers'",22,112,42,null,"Abingdon 'Park Rangers'",null,1,3,4]
["Wk 2","2018-10-04","Woodcote 'Wings'",null,0,18,null,"Abingdon 'Park Rangers'",null,8,23,"L",-5,"W",5,null,"Aston 'Astons'",16,95,15,null,"Aston 'Astons'",null,2,2,4]
["x",{"$nulls":10},"L",0,"L",0,null,"Benson SMBC",17,90,12,null,"Benson SMBC",null,2,2,4]
["Wk 3","2018-10-09","Drayton 'Wasps'",null,8,33,"v","Kingston 'Kites'",null,0,9,"W",24,"L",-24,null,"Didcot Bowls Club 'Red Kites'",30,92,24,null,"Didcot Bowls Club 'Red Kites'",null,null,4,4]
["Wk 3","2018-10-10","Didcot Bowls Club 'Red Kites'",null,8,24,"v","Harwell 'Eagles'",null,0,18,"W",6,"L",-6,null,"Drayton 'Wasps'",22,85,42,null,"Drayton 'Wasps'",null,null,3,3]
["Wk 3","2018-10-11","Woodcote 'Wings'",null,2,17,null,"Aston 'Astons'",null,6,24,"L",-7,"W",7,null,"Harwell 'Eagles'",20,130,5,null,"Harwell 'Eagles'",null,2,3,5]
["Wk 3","2018-10-12","Abingdon 'Park Rangers'",null,8,24,"v","Benson SMBC",null,0,8,"W",16,"L",-16,null,"Kingston 'Kites'",18,92,9,null,"Kingston 'Kites'",null,2,2,4]
["x",{"$nulls":10},"L",0,"L",0,null,"Stanford 'Blues'",8,41,1,null,"Stanford 'Blues'",null,1,1,2]
["Wk 4","2018-10-15","Benson SMBC",null,2,21,"v","Drayton 'Wasps'",null,6,26,"L",-5,"W",5,null,"Woodcote 'Wings'",14,108,-11,null,"Woodcote 'Wings'",null,4,1,5]
["Wk 4","2018-10-17","Aston 'Astons'",null,6,26,"v","Abingdon 'Park Rangers'",null,2,21,"W",5,"L",-5,null,"(blank)",null,null,0,null,"(blank)"]
["Wk 4","2018-10-17","Kingston 'Kites'",null,6,23,null,"Didcot Bowls Club 'Red Kites'",null,2,22,"W",1,"L",-1,null,"Grand Total",167,845,139,null,"Grand Total",null,14,21,35]
["x",{"$nulls":10},"L",0,"L",0]
["Wk 5","2018-10-26","Abingdon 'Park Rangers'",null,0,18,"v","Didcot Bowls Club 'Red Kites'",null,8,29,"L",-11,"W",11]
["x",{"$nulls":10},"L",0,"L",0]
["Wk 6","2018-10-30","Stanford 'Blues'",null,7,23,"v","Kingston 'Kites'",null,1,16,"W",7,"L",-7]
["Wk 6","2018-10-31","Didcot Bowls Club 'Red Kites'",null,6,22,"v","Benson SMBC",null,2,17,"W",5,"L",-5,null,null,"Values",{"$nulls":3},"Count of Pts","Column Labels"]
["Wk 6","2018-11-01","Woodcote 'Wings'",null,8,28,"v","Harwell 'Eagles'",null,0,20,"W",8,"L",-8,null,"Row Labels","Sum of Pts","Sum of Sht","Sum of Diff2",null,"Row Labels","D","L","W","Grand Total"]
["Wk 6","2018-11-02","Abingdon 'Park Rangers'",null,6,24,"v","Drayton 'Wasps'",null,2,21,"W",3,"L",-3,null,"Abingdon 'Park Rangers'",18,95,-3,null,"Abingdon 'Park Rangers'",null,2,2,4]
["x",{"$nulls":10},"L",0,"L",0,null,"Aston 'Astons'",14,84,-2,null,"Aston 'Astons'",null,2,2,4]
["Wk 7","2018-11-05","Benson SMBC",null,6,25,"v","Stanford 'Blues'",null,2,12,"W",13,"L",-13,null,"Benson SMBC",8,64,-32,null,"Benson SMBC",null,3,1,4]
["Wk 7","2018-11-06","Drayton 'Wasps'",null,8,31,"v","Didcot Bowls Club 'Red Kites'",null,0,16,"W",15,"L",-15,null,"Didcot Bowls Club 'Red Kites'",16,93,0,null,"Didcot Bowls Club 'Red Kites'",null,2,2,4]
["Wk 7","2018-11-07","Kingston 'Kites'",null,2,20,"v","Woodcote 'Wings'",null,6,22,{"$f":"IF(E40=\" \",\" \",IF(E40<4,\"L\",IF(E40=4,\"D\",\"W\")))","v":"L"},{"$f":"F40-K40","v":-2},{"$f":"IF(J40=\" \",\" \",IF(J40<4,\"L\",IF(J40=4,\"D\",\"W\")))","v":"W"},{"$f":"K40-F40","v":2},null,"Drayton 'Wasps'",29,133,30,null,"Drayton 'Wasps'",null,1,4,5]
["Wk 7","2018-11-08","Harwell 'Eagles'",null,0,19,"v","Aston 'Astons'",null,8,25,"L",-6,"W",6,null,"Harwell 'Eagles'",7,60,-9,null,"Harwell 'Eagles'",null,2,1,3]
["x",{"$nulls":10},"L",0,"L",0,null,"Kingston 'Kites'",1,55,-66,null,"Kingston 'Kites'",null,4,null,4]
["Wk 8","2018-11-14","Aston 'Astons'",null,8,35,"v","Kingston 'Kites'",null,0,13,"W",22,"L",-22,null,"Stanford 'Blues'",12,82,-56,null,"Stanford 'Blues'",null,4,1,5]
["Wk 8","2018-11-15","Woodcote 'Wings'",null,2,24,"v","Benson SMBC",null,6,26,"L",-2,"W",2,null,"Woodcote 'Wings'",8,40,-1,null,"Woodcote 'Wings'",null,1,1,2]
["x",{"$nulls":10},"L",0,"L",0,null,"(blank)",null,null,0,null,"(blank)"]
["Wk 9","2018-11-19","Benson SMBC",null,8,27,"v","Aston 'Astons'",null,0,18,"W",9,"L",-9,null,"Grand Total",113,706,-139,null,"Grand Total",null,21,14,35]
["Wk 9","2018-11-22","Harwell 'Eagles'",null,6,31,"v","Stanford 'Blues'",null,2,18,"W",13,"L",-13]
["x",{"$nulls":10},"L",0,"L",0]
["Wk10","2018-11-27","Drayton 'Wasps'",null,6,21,"v","Woodcote 'Wings'",null,2,18,"W",3,"L",-3]
["Wk10","2018-11-29","Harwell 'Eagles'",null,6,31,null,"Abingdon 'Park Rangers'",null,2,25,"W",6,"L",-6]
["x",{"$nulls":10},"L",0,"L",0]
["Wk11","2018-12-05","Aston 'Astons'",null,2,21,"v","Drayton 'Wasps'",null,6,22,"L",-1,"W",1]
["Wk11","2018-12-06","Harwell 'Eagles'",null,8,30,"v","Kingston 'Kites'",null,0,17,"W",13,"L",-13]
["Wk11","2018-12-06","Woodcote 'Wings'",null,2,21,"v","Didcot Bowls Club 'Red Kites'",null,6,26,"L",-5,"W",5]
["Wk11","2018-12-07","Abingdon 'Park Rangers'",null,8,46,"v","Stanford 'Blues'",null,0,12,"W",34,"L",-34]
["x",{"$nulls":10},"L",0,"L",0]
["Wk12","2018-12-10","Benson SMBC",null,1,17,"v","Harwell 'Eagles'",null,7,22,"L",-5,"W",5]
["Wk12","2018-12-11","Stanford 'Blues'",null,1,18,"v","Drayton 'Wasps'",null,7,24,"L",-6,"W",6]
["Wk12","2018-12-12","Didcot Bowls Club 'Red Kites'",null,8,23,"v","Aston 'Astons'",null,0,17,"W",6,"L",-6]
["Wk12","2018-12-12","Kingston 'Kites'",null,2,23,"v","Abingdon 'Park Rangers'",null,6,26,"L",-3,"W",3]
["x",{"$nulls":10},"L",0,"L",0]
["Wk13","2018-12-19","Didcot Bowls Club 'Red Kites'",null,8,23,"v","Stanford 'Blues'",null,0,16,"W",7,"L",-7]
["x",{"$nulls":10},"L",0,"L",0]
["Wk16","2019-01-14","Benson SMBC",{"$nulls":3},"v","Abingdon 'Park Rangers'",{"$nulls":3},"L",0,"L",0]
["Wk16","2019-01-16","Aston 'Astons'",{"$nulls":3},"v","Woodcote 'Wings'",{"$nulls":3},"L",0,"L",0]
["Wk16","2019-01-16","Kingston 'Kites'",{"$nulls":3},"v","Drayton 'Wasps'",{"$nulls":3},"L",0,"L",0]
["Wk16","2019-01-17","Harwell 'Eagles'",{"$nulls":3},"v","Didcot Bowls Club 'Red Kites'",{"$nulls":3},"L",0,"L",0]
["x",{"$nulls":10},"L",0,"L",0]
["Wk17","2019-01-22","Drayton 'Wasps'",{"$nulls":3},"v","Benson SMBC",{"$nulls":3},"L",0,"L",0]
["Wk17","2019-01-22","Stanford 'Blues'",{"$nulls":3},"v","Harwell 'Eagles'",{"$nulls":3},"L",0,"L",0]
["Wk17","2019-01-23","Didcot Bowls Club 'Red Kites'",{"$nulls":3},"v","Kingston 'Kites'",{"$nulls":3},"L",0,"L",0]
["Wk17","2019-01-25","Abingdon 'Park Rangers'",{"$nulls":3},"v","Aston 'Astons'",{"$nulls":3},"L",0,"L",0]
["x",{"$nulls":10},"L",0,"L",0]
["Wk18","2019-01-28","Benson SMBC",{"$nulls":3},"v","Didcot Bowls Club 'Red Kites'",{"$nulls":3},"L",0,"L",0]
["Wk18","2019-01-29","Drayton 'Wasps'",{"$nulls":3},"v","Abingdon 'Park Rangers'",{"$nulls":3},"L",0,"L",0]
["Wk18","2019-01-30","Kingston 'Kites'",{"$nulls":3},"v","Stanford 'Blues'",{"$nulls":3},"L",0,"L",0]
["Wk18","2019-01-31","Harwell 'Eagles'",{"$nulls":3},"v","Woodcote 'Wings'",{"$nulls":3},"L",0,"L",0]
["x",{"$nulls":10},"L",0,"L",0]
["Wk19","2019-02-06","Didcot Bowls Club 'Red Kites'",{"$nulls":3},"v","Drayton 'Wasps'",{"$nulls":3},"L",0,"L",0]
["x",{"$nulls":10},"L",0,"L",0]
["Wk20","2019-02-12","Stanford 'Blues'",{"$nulls":3},"v","Benson SMBC",{"$nulls":3},"L",0,"L",0]
["Wk20","2019-02-13","Aston 'Astons'",{"$nulls":3},"v","Harwell 'Eagles'",{"$nulls":3},"L",0,"L",0]
["Wk20","2019-02-14","Woodcote 'Wings'",{"$nulls":3},"v","Kingston 'Kites'",{"$nulls":3},"L",0,"L",0]
["x",{"$nulls":10},"L",0,"L",0]
["Wk21","2019-02-18","Benson SMBC",{"$nulls":3},"v","Woodcote 'Wings'",{"$nulls":3},"L",0,"L",0]
["Wk21","2019-02-19","Drayton 'Wasps'",{"$nulls":3},"v","Stanford 'Blues'",{"$nulls":3},"L",0,"L",0]
["Wk21","2019-02-20","Didcot Bowls Club 'Red Kites'",{"$nulls":3},"v","Abingdon 'Park Rangers'",{"$nulls":3},"L",0,"L",0]
["Wk21","2019-02-20","Kingston 'Kites'",{"$nulls":3},"v","Aston 'Astons'",{"$nulls":3},"L",0,"L",0]
["x",{"$nulls":10},"L",0,"L",0]
["Wk22","2019-02-26","Stanford 'Blues'",{"$nulls":3},"v","Didcot Bowls Club 'Red Kites'",{"$nulls":3},"L",0,"L",0]
["Wk22","2019-02-27","Aston 'Astons'",{"$nulls":3},"v","Benson SMBC",{"$nulls":3},"L",0,"L",0]
["Wk22","2019-02-28","Woodcote 'Wings'",{"$nulls":3},"v","Drayton 'Wasps'",{"$nulls":3},"L",0,"L",0]
["Wk22","2019-03-01","Abingdon 'Park Rangers'",{"$nulls":3},"v","Harwell 'Eagles'",{"$nulls":3},"L",0,"L",0]
["x",{"$nulls":10},"L",0,"L",0]
["Wk23","2019-03-05","Stanford 'Blues'",{"$nulls":3},"v","Woodcote 'Wings'",{"$nulls":3},{"$f":"IF(E95=\" \",\" \",IF(E95<4,\"L\",IF(E95=4,\"D\",\"W\")))","v":"L"},{"$f":"F95-K95","v":0},{"$f":"IF(J95=\" \",\" \",IF(J95<4,\"L\",IF(J95=4,\"D\",\"W\")))","v":"L"},{"$f":"K95-F95","v":0}]
["Wk23","2019-03-06","Didcot Bowls Club 'Red Kites'",{"$nulls":3},"v","Woodcote 'Wings'",{"$nulls":3},"L",0,"L",0]
["x",{"$nulls":10},"L",0,"L",0]
["Wk24","2019-03-12","Drayton 'Wasps'",{"$nulls":3},"v","Aston 'Astons'",{"$nulls":3},"L",0,"L",0]
["Wk24","2019-03-12","Stanford 'Blues'",{"$nulls":3},"v","Abingdon 'Park Rangers'",{"$nulls":3},"L",0,"L",0]
["Wk24","2019-03-13","Kingston 'Kites'",{"$nulls":3},"v","Harwell 'Eagles'",{"$nulls":3},"L",0,"L",0]
["x",{"$nulls":10},"L",0,"L",0]
["Wk25","2019-03-20","Aston 'Astons'",{"$nulls":3},"v","Didcot Bowls Club 'Red Kites'",{"$nulls":3},"L",0,"L",0]
["Wk25","2019-03-21","Harwell 'Eagles'",{"$nulls":3},"v","Benson SMBC",{"$nulls":3},"L",0,"L",0]
["Wk25","2019-03-21","Woodcote 'Wings'",{"$nulls":3},"v","Stanford 'Blues'",{"$nulls":3},{"$f":"IF(E104=\" \",\" \",IF(E104<4,\"L\",IF(E104=4,\"D\",\"W\")))","v":"L"},{"$f":"F104-K104","v":0},{"$f":"IF(J104=\" \",\" \",IF(J104<4,\"L\",IF(J104=4,\"D\",\"W\")))","v":"L"},{"$f":"K104-F104","v":0}]
["Wk25","2019-03-22","Abingdon 'Park Rangers'",{"$nulls":3},"v","Kingston 'Kites'",{"$nulls":3},"L",0,"L",0]
["x",{"$nulls":10},"L",0,"L",0]
["Wk26","2019-03-25","Benson SMBC",{"$nulls":3},"v","Kingston 'Kites'",{"$nulls":3},"L",0,"L",0]
["Wk26","2019-03-26","Drayton 'Wasps'",{"$nulls":3},"v","Harwell 'Eagles'",{"$nulls":3},"L",0,"L",0]
["Wk26","2019-03-26","Stanford 'Blues'",{"$nulls":3},"v","Aston 'Astons'",{"$nulls":3},"L",0,"L",0]
["Wk26","2019-03-29","Abingdon 'Park Rangers'",{"$nulls":3},"v","Woodcote 'Wings'",{"$nulls":3},"L",0,"L",0]
["x",{"$nulls":10},"L",0,"L",0]
["x",{"$nulls":10},"D",0,"D",0]
["x"]
["x"]
["x"]
["x"]
["x"]
["x"]
["x"]
["x"]
["x"]
["x"]
["x"]
["x"]
["x"]
["x"]
["x"]
["x"]
["x"]
["x"]
["x"]
["x"]
["x"]
["x"]
["x"]
["x"]
["x"]
["x"]
["x"]
["x"]
["x"]
["x"]
["x"]
["x"]
["x"]
["x"]
["x"]
["x"]
["x"]
["x"]
["x"]

{"sheet":"Afternoon Div 2","index":4,"n_rows":153,"n_cols":26,"rows_kept":153}
[{"$nulls":6},"Afternoon - Division Two",{"$nulls":8},{"$f":"SUM(K5:K14)/8","v":{"v":29,"d":"29.0"}},{"$f":"INT(P1)","v":{"v":29,"d":"29.0"}}]
[{"$nulls":6},"Results For Season 2018-19"]
[{"$nulls":3},"Fixtures",{"$nulls":4},"Shots",{"$nulls":6},{"$f":"SUBTOTAL(9,P4:P12)/8","v":{"v":83,"d":"83.0"}},"Games"]
[null," ",null,"Play","W","D","L","For","Aga","Diff","Pts"]
[null,"Stanford 'Greys'",null,{"$f":"VLOOKUP($B5,$V$33:$Z$47,5,0)+VLOOKUP($B5,$V$18:$Z$30,5,0)","v":7},{"$f":"VLOOKUP($B5,$V$33:$Z$47,4,0)+VLOOKUP($B5,$V$18:$Z$30,4,0)","v":5},{"$f":"VLOOKUP($B5,$V$33:$Z$47,2,0)+VLOOKUP($B5,$V$18:$Z$30,2,0)","v":0},{"$f":"VLOOKUP($B5,$V$33:$Z$47,3,0)+VLOOKUP($B5,$V$18:$Z$30,3,0)","v":2},{"$f":"VLOOKUP($B5,$Q$18:$S$30,3,0)+VLOOKUP($B5,$Q$35:$S$47,3,0)","v":197},{"$f":"H5-J5","v":137},{"$f":"VLOOKUP($B5,$Q$18:$T$30,4,0)+VLOOKUP($B5,$Q$35:$T$47,4,0)","v":60},{"$f":"VLOOKUP($B5,$Q$18:$T$30,2,0)+VLOOKUP($B5,$Q$35:$T$47,2,0)","v":40},{"$nulls":4},{"$f":"(14-D5)*8+K5","v":96}]
[null,"Chosley 'Chaffinches'",null,8,5,0,3,216,161,55,36,{"$nulls":4},{"$f":"(14-D6)*8+K6","v":84}]
[null,"Harwell 'Swifts'",null,8,4,0,4,176,182,-6,36,{"$nulls":4},84]
[null,"Abingdon 'Optimists'",null,7,4,0,3,167,153,14,30,{"$nulls":4},86]
[null,"Drayton 'Hammers'",null,7,4,0,3,173,162,11,30,{"$nulls":4},86]
[null,"Woodcote 'Woodpeckers'",null,7,3,0,4,167,156,11,28,{"$nulls":4},84]
[null,"Abingdon ' Ascendants'",null,7,3,0,4,131,191,-60,20,{"$nulls":4},76]
[null,"Didcot Bowls Club 'Buzzards'",null,7,1,0,6,118,203,-85,12,{"$nulls":4},68]
[]
[null,"DATE","Home",".","Pts","Sht","v","Away",".","Pts","Sht","Result","Diff","Result","Diff",{"$nulls":6},"Sht","(All)"]
["Wk 2","2018-10-02","Drayton 'Hammers'",null,8,32,"v","Woodcote 'Woodpeckers'",null,0,11,{"$f":"IF(E15=\" \",\" \",IF(E15<4,\"L\",IF(E15=4,\"D\",\"W\")))","v":"W"},{"$f":"F15-K15","v":21},{"$f":"IF(J15=\" \",\" \",IF(J15<4,\"L\",IF(J15=4,\"D\",\"W\")))","v":"L"},{"$f":"K15-F15","v":-21},null,"Home"]
["Wk 2","2018-10-02","Stanford 'Greys'",null,8,29,"v","Abingdon 'Optimists'",null,0,17,"W",12,"L",{"$f":"K16-F16","v":-12},null,null,"Values",{"$nulls":3},"Count of Pts","Column Labels"]
["Wk 2","2018-10-03","Didcot Bowls Club 'Buzzards'",null,2,16,"v","Harwell 'Swifts'",null,6,21,"L",-5,"W",5,null,"Row Labels","Sum of Pts","Sum of Sht","Sum of Diff",null,"Row Labels","D","L","W","Grand Total"]
["Wk 2","2018-10-05","Abingdon ' Ascendants'",null,6,22,"v","Chosley 'Chaffinches'",null,2,21,"W",1,"L",-1,null,"Abingdon ' Ascendants'",12,58,-15,null,"Abingdon ' Ascendants'",null,1,2,3]
["x",{"$nulls":10},"L",0,"L",0,null,"Abingdon 'Optimists'",28,118,53,null,"Abingdon 'Optimists'",null,null,4,4]
["Wk 3","2018-10-10","Abingdon 'Optimists'",null,6,28,"v","Abingdon ' Ascendants'",null,2,20,"W",8,{"$f":"IF(J20=\" \",\" \",IF(J20<4,\"L\",IF(J20=4,\"D\",\"W\")))","v":"L"},-8,null,"Chosley 'Chaffinches'",20,115,28,null,"Chosley 'Chaffinches'",null,1,3,4]
["Wk 3","2018-10-11","Chosley 'Chaffinches'",null,6,38,"v","Didcot Bowls Club 'Buzzards'",null,2,20,"W",18,"L",-18,null,"Didcot Bowls Club 'Buzzards'",8,71,-33,null,"Didcot Bowls Club 'Buzzards'",null,3,1,4]
["x",{"$nulls":10},"L",0,"L",0,null,"Drayton 'Hammers'",22,107,23,null,"Drayton 'Hammers'",null,1,3,4]
["Wk 4","2018-10-16","Drayton 'Hammers'",null,0,14,"v","Chosley 'Chaffinches'",null,8,39,"L",-25,"W",25,null,"Harwell 'Swifts'",26,102,25,null,"Harwell 'Swifts'",null,1,3,4]
["Wk 4","2018-10-17","Didcot Bowls Club 'Buzzards'",null,6,27,"v","Abingdon 'Optimists'",null,2,14,"W",13,"L",-13,null,"Stanford 'Greys'",22,92,42,null,"Stanford 'Greys'",null,null,3,3]
["Wk 4","2018-10-19","Abingdon ' Ascendants'",null,0,15,"v","Woodcote 'Woodpeckers'",null,8,35,"L",-20,"W",20,null,"Woodcote 'Woodpeckers'",18,83,24,null,"Woodcote 'Woodpeckers'",null,1,2,3]
["x",{"$nulls":10},"L",0,"L",0,null,"(blank)",null,null,0,null,"(blank)"]
["Wk 5","2018-10-23","Stanford 'Greys'",null,6,29,"v","Harwell 'Swifts'",null,2,20,"W",9,"L",-9,null,"Grand Total",156,746,147,null,"Grand Total",null,8,21,29]
["Wk 5","2018-10-25","Harwell 'Swifts'",null,8,29,"v","Drayton 'Hammers'",null,0,22,"W",7,"L",-7]
["x",{"$nulls":10},"L",0,"L",0]
["Wk 6","2018-11-01","Harwell 'Swifts'",null,2,22,"v","Abingdon ' Ascendants'",null,6,25,"L",-3,"W",3]
["x",{"$nulls":10},"L",0,"L",0]
["Wk 7","2018-11-07","Abingdon 'Optimists'",null,8,35,"v","Drayton 'Hammers'",null,0,13,"W",22,"L",-22]
["Wk 7","2018-11-08","Chosley 'Chaffinches'",null,0,18,"v","Stanford 'Greys'",null,8,27,"L",-9,"W",9,null,null,"Values",{"$nulls":3},"Count of Pts","Column Labels"]
["Wk 7","2018-11-08","Woodcote 'Woodpeckers'",null,8,40,"v","Didcot Bowls Club 'Buzzards'",null,0,10,"W",30,"L",-30,null,"Row Labels","Sum of Pts","Sum of Sht","Sum of Diff2",null,"Row Labels","D","L","W","Grand Total"]
["x",{"$nulls":10},"L",0,"L",0,null,"Abingdon ' Ascendants'",8,73,-45,null,"Abingdon ' Ascendants'",null,3,1,4]
["Wk 8","2018-11-15","Chosley 'Chaffinches'",null,8,32,"v","Abingdon 'Optimists'",null,0,18,"W",14,"L",-14,null,"Abingdon 'Optimists'",2,49,-39,null,"Abingdon 'Optimists'",null,3,null,3]
["Wk 8","2018-11-15","Harwell 'Swifts'",null,8,28,"v","Woodcote 'Woodpeckers'",null,0,17,"W",11,"L",-11,null,"Chosley 'Chaffinches'",16,101,27,null,"Chosley 'Chaffinches'",null,2,2,4]
["Wk 8","2018-11-16","Abingdon ' Ascendants'",null,6,21,"v","Didcot Bowls Club 'Buzzards'",null,2,17,"W",4,"L",-4,null,"Didcot Bowls Club 'Buzzards'",4,47,-52,null,"Didcot Bowls Club 'Buzzards'",null,3,null,3]
["x",{"$nulls":10},"L",0,"L",0,null,"Drayton 'Hammers'",8,66,-12,null,"Drayton 'Hammers'",null,2,1,3]
["Wk 9","2018-11-20","Drayton 'Hammers'",null,6,27,"v","Stanford 'Greys'",null,2,19,{"$f":"IF(E40=\" \",\" \",IF(E40<4,\"L\",IF(E40=4,\"D\",\"W\")))","v":"W"},{"$f":"F40-K40","v":8},{"$f":"IF(J40=\" \",\" \",IF(J40<4,\"L\",IF(J40=4,\"D\",\"W\")))","v":"L"},{"$f":"K40-F40","v":-8},null,"Harwell 'Swifts'",10,74,-31,null,"Harwell 'Swifts'",null,3,1,4]
["Wk 9","2018-11-22","Woodcote 'Woodpeckers'",null,8,28,"v","Stanford 'Greys'",null,0,21,"W",7,"L",-7,null,"Stanford 'Greys'",18,105,18,null,"Stanford 'Greys'",null,2,2,4]
["x",{"$nulls":15},"Woodcote 'Woodpeckers'",10,84,-13,null,"Woodcote 'Woodpeckers'",null,3,1,4]
["Wk10","2018-11-27","Stanford 'Greys'",null,8,34,"v","Abingdon ' Ascendants'",null,0,13,"W",21,"L",-21,null,"(blank)",null,null,0,null,"(blank)"]
["Wk10","2018-11-28","Abingdon 'Optimists'",null,8,33,"v","Harwell 'Swifts'",null,0,11,"W",22,"L",-22,null,"Grand Total",76,599,-147,null,"Grand Total",null,21,8,29]
["Wk10","2018-11-28","Didcot Bowls Club 'Buzzards'",null,0,14,"v","Drayton 'Hammers'",null,8,31,"L",-17,"W",17]
["Wk10","2018-11-29","Woodcote 'Woodpeckers'",null,2,15,"v","Chosley 'Chaffinches'",null,6,28,"L",-13,"W",13]
["x",{"$nulls":10},"L",0,"L",0]
["Wk11","2018-12-04","Drayton 'Hammers'",null,8,34,"v","Abingdon ' Ascendants'",null,0,15,{"$f":"IF(E48=\" \",\" \",IF(E48<4,\"L\",IF(E48=4,\"D\",\"W\")))","v":"W"},{"$f":"F48-K48","v":19},"L",{"$f":"K48-F48","v":-19}]
["Wk11","2018-12-05","Abingdon 'Optimists'",null,6,22,"v","Woodcote 'Woodpeckers'",null,2,21,"W",1,"L",-1]
["Wk11","2018-12-05","Didcot Bowls Club 'Buzzards'",null,0,14,"v","Stanford 'Greys'",null,8,38,"L",-24,"W",24]
["Wk11","2018-12-06","Chosley 'Chaffinches'",null,6,27,"v","Harwell 'Swifts'",null,2,22,"W",5,"L",-5]
["x",{"$nulls":10},"L",0,"L",0]
["Wk12","2018-12-13","Harwell 'Swifts'",null,8,23,"v","Chosley 'Chaffinches'",null,0,13,"W",10,"L",-10]
["x",{"$nulls":10},"L",0,"L",0]
["Wk16","2019-01-15","Stanford 'Greys'",{"$nulls":3},"v","Didcot Bowls Club 'Buzzards'",{"$nulls":3},"L",0,"L",0]
["Wk16","2019-01-17","Woodcote 'Woodpeckers'",{"$nulls":3},"v","Abingdon 'Optimists'",{"$nulls":3},"L",0,"L",0]
["Wk16","2019-01-18","Abingdon ' Ascendants'",{"$nulls":3},"v","Drayton 'Hammers'",{"$nulls":3},"L",0,"L",0]
["x",{"$nulls":10},"L",0,"L",0]
["Wk17","2019-01-23","Abingdon 'Optimists'",{"$nulls":3},"v","Didcot Bowls Club 'Buzzards'",{"$nulls":3},"L",0,"L",0]
["Wk17","2019-01-24","Chosley 'Chaffinches'",{"$nulls":3},"v","Drayton 'Hammers'",{"$nulls":3},"L",0,"L",0]
["Wk17","2019-01-24","Harwell 'Swifts'",{"$nulls":3},"v","Stanford 'Greys'",{"$nulls":3},"L",0,"L",0]
["Wk17","2019-01-24","Woodcote 'Woodpeckers'",{"$nulls":3},"v","Abingdon ' Ascendants'",{"$nulls":3},"L",0,"L",0]
["x",{"$nulls":10},"L",0,"L",0]
["Wk18","2019-01-29","Stanford 'Greys'",{"$nulls":3},"v","Woodcote 'Woodpeckers'",{"$nulls":3},"L",0,"L",0]
["Wk18","2019-02-01","Abingdon ' Ascendants'",{"$nulls":3},"v","Abingdon 'Optimists'",{"$nulls":3},"L",0,"L",0]
["Wk18","2019-01-30","Didcot Bowls Club 'Buzzards'",{"$nulls":3},"v","Chosley 'Chaffinches'",{"$nulls":3},"L",0,"L",0]
["Wk18","2019-01-29","Drayton 'Hammers'",{"$nulls":3},"v","Harwell 'Swifts'",{"$nulls":3},"L",0,{"$f":"IF(J67=\" \",\" \",IF(J67<4,\"L\",IF(J67=4,\"D\",\"W\")))","v":"L"},0]
["x",{"$nulls":10},"L",0,"L",0]
["Wk20","2019-02-12","Drayton 'Hammers'",{"$nulls":3},"v","Abingdon 'Optimists'",{"$nulls":3},"L",0,{"$f":"IF(J69=\" \",\" \",IF(J69<4,\"L\",IF(J69=4,\"D\",\"W\")))","v":"L"},0]
["Wk20","2019-02-13","Didcot Bowls Club 'Buzzards'",{"$nulls":3},"v","Woodcote 'Woodpeckers'",{"$nulls":3},"L",0,{"$f":"IF(J70=\" \",\" \",IF(J70<4,\"L\",IF(J70=4,\"D\",\"W\")))","v":"L"},0]
["x",{"$nulls":10},"L",0,"L",0]
["Wk21","2019-02-19","Stanford 'Greys'",{"$nulls":3},"v","Chosley 'Chaffinches'",{"$nulls":3},"L",0,"L",0]
["Wk21","2019-02-22","Abingdon ' Ascendants'",{"$nulls":3},"v","Harwell 'Swifts'",{"$nulls":3},"L",0,"L",0]
["x",{"$nulls":10},"L",0,"L",0]
["Wk22","2019-02-26","Drayton 'Hammers'",{"$nulls":3},"v","Didcot Bowls Club 'Buzzards'",{"$nulls":3},"L",0,"L",0]
["Wk22","2019-02-28","Chosley 'Chaffinches'",{"$nulls":3},"v","Woodcote 'Woodpeckers'",{"$nulls":3},"L",0,"L",0]
["Wk22","2019-02-28","Harwell 'Swifts'",{"$nulls":3},"v","Abingdon 'Optimists'",{"$nulls":3},"L",0,"L",0]
["x",{"$nulls":10},"L",0,"L",0]
["Wk23","2019-03-08","Abingdon ' Ascendants'",{"$nulls":3},"v","Stanford 'Greys'",{"$nulls":3},"L",0,"L",0]
["x"]
["Wk24","2019-03-13","Abingdon 'Optimists'",{"$nulls":3},"v","Chosley 'Chaffinches'",{"$nulls":3},{"$f":"IF(E81=\" \",\" \",IF(E81<4,\"L\",IF(E81=4,\"D\",\"W\")))","v":"L"},{"$f":"F81-K81","v":0},{"$f":"IF(J81=\" \",\" \",IF(J81<4,\"L\",IF(J81=4,\"D\",\"W\")))","v":"L"},{"$f":"K81-F81","v":0}]
["Wk24","2019-03-13","Didcot Bowls Club 'Buzzards'",{"$nulls":3},"v","Abingdon ' Ascendants'",{"$nulls":3},"L",0,"L",0]
["Wk24","2019-03-14","Woodcote 'Woodpeckers'",{"$nulls":3},"v","Harwell 'Swifts'",{"$nulls":3},"L",0,"L",0]
["x",{"$nulls":10},"L",0,"L",0]
["Wk25","2019-03-19","Stanford 'Greys'",{"$nulls":3},"v","Drayton 'Hammers'",{"$nulls":3},"L",0,"L",0]
["x",{"$nulls":10},"L",0,"L",0]
["Wk26","2019-03-27","Abingdon 'Optimists'",{"$nulls":3},"v","Stanford 'Greys'",{"$nulls":3},"L",0,"L",0]
["Wk26","2019-03-28","Chosley 'Chaffinches'",{"$nulls":3},"v","Abingdon ' Ascendants'",{"$nulls":3},{"$f":"IF(E88=\" \",\" \",IF(E88<4,\"L\",IF(E88=4,\"D\",\"W\")))","v":"L"},{"$f":"F88-K88","v":0},{"$f":"IF(J88=\" \",\" \",IF(J88<4,\"L\",IF(J88=4,\"D\",\"W\")))","v":"L"},{"$f":"K88-F88","v":0}]
["Wk26","2019-03-28","Harwell 'Swifts'",{"$nulls":3},"v","Didcot Bowls Club 'Buzzards'",{"$nulls":3},{"$f":"IF(E89=\" \",\" \",IF(E89<4,\"L\",IF(E89=4,\"D\",\"W\")))","v":"L"},{"$f":"F89-K89","v":0},{"$f":"IF(J89=\" \",\" \",IF(J89<4,\"L\",IF(J89=4,\"D\",\"W\")))","v":"L"},{"$f":"K89-F89","v":0}]
["Wk26","2019-03-28","Woodcote 'Woodpeckers'",{"$nulls":3},"v","Drayton 'Hammers'",{"$nulls":3},{"$f":"IF(E90=\" \",\" \",IF(E90<4,\"L\",IF(E90=4,\"D\",\"W\")))","v":"L"},{"$f":"F90-K90","v":0},{"$f":"IF(J90=\" \",\" \",IF(J90<4,\"L\",IF(J90=4,\"D\",\"W\")))","v":"L"},{"$f":"K90-F90","v":0}]
["x",{"$nulls":10},{"$f":"IF(E91=\" \",\" \",IF(E91<4,\"L\",IF(E91=4,\"D\",\"W\")))","v":"L"},{"$f":"F91-K91","v":0},{"$f":"IF(J91=\" \",\" \",IF(J91<4,\"L\",IF(J91=4,\"D\",\"W\")))","v":"L"},{"$f":"K91-F91","v":0}]
["x",{"$nulls":10},"W",{"$f":"F88-K88","v":0},"W",{"$f":"K88-F88","v":0}]
["x",{"$nulls":10},"D",{"$f":"F89-K89","v":0},"D",{"$f":"K89-F89","v":0}]
[]
["x"]
["x"]
["x"]
["x"]
["x"]
["x"]
["x"]
["x"]
["x"]
["x"]
["x"]
["x"]
["x"]
["x"]
["x"]
["x"]
["x"]
["x"]
["x"]
["x"]
["x"]
["x"]
["x"]
["x"]
["x"]
["x"]
["x"]
["x"]
["x"]
["x"]
["x"]
["x"]
["x"]
["x"]
["x"]
["x"]
["x"]
["x"]
["x"]
["x"]
["x"]
["x"]
["x"]
["x"]
["x"]
["x"]
["x"]
["x"]
["x"]
["x"]
["x"]
["x"]
["x"]
["x"]
["x"]
["x"]
["x"]
["x"]
["x"]